program: Gaussian 09
title: 000166364
version: EM64L-G09RevD.01
frameworkgroup: C1[X(C14H22O2)]
method: RPBEPBE
basis: SDD
operation: Freq
keyword: #pfreq=noraman
keyword: PBEPBE/SDD
title: #p freq=noraman PBEPBE/SDD
converged: NO YES NO NO
title: Mulliken charges:
elementType: O O C C C C C C C C C C C C C C H H H H H H H H H H H H H H H H H H H H H H
charge: -0.189213 -0.202758 -0.219659 -0.438504 -0.527748 -0.433044 0.444174 0.205596 -0.382679 -0.630351 -0.533172 -0.041942 0.247413 -0.826940 -0.712893 -0.691176 0.226001 0.215657 0.216321 0.225986 0.211271 0.203351 0.263326 0.207491 0.251154 0.250427 0.236035 0.215949 0.206564 0.225054 0.228676 0.211164 0.214427 0.265456 0.194713 0.207815 0.242044 0.214014
chargesum: 0.00000
title: Mulliken charges with hydrogens summed into heavy atoms:
elementType: O O C C C C C C C C C C C C C C
charge: -0.189213 -0.202758 0.006342 -0.006526 -0.090491 0.033633 0.444174 0.205596 -0.175187 -0.128769 -0.081188 0.164622 0.247413 -0.162047 -0.038297 -0.027304
polarizability: 1.69659837e+02 4.69405878e+00 1.44422332e+02 -5.58530749e-01 -5.88969779e+00 1.39342249e+02
1716.lowfreq: -15.5612 -12.9516 -4.1775 -0.0008 -0.0001 0.0006 7.8087 22.0601 36.4164
frequency: -1.6351 18.8429 36.3271 48.6452 81.9320 97.4838 118.5005 135.6695 162.0626 179.8988 196.6977 232.6407 249.2232 264.9687 273.8000 308.6102 316.7782 349.2746 355.3083 385.0896 414.4794 432.9362 437.8600 489.0692 532.8509 586.0119 604.4190 620.7448 691.4957 743.9696 780.3751 801.3551 823.5375 840.6943 868.7569 898.8003 900.6918 917.8652 926.6166 931.3007 955.7611 964.9199 966.0817 1009.6688 1019.3665 1031.6239 1055.8544 1060.2705 1093.2086 1105.8981 1118.5144 1145.5107 1158.6537 1172.3093 1174.8998 1178.8982 1195.9281 1225.4211 1237.4060 1247.4432 1259.1534 1274.4570 1311.3078 1327.1635 1335.9392 1343.2849 1344.8736 1349.9764 1368.3129 1387.6258 1391.8983 1405.0147 1429.2153 1442.7229 1453.9253 1459.0409 1462.1243 1464.9719 1471.1426 1474.7153 1474.9814 1486.4272 1496.2113 1599.1819 1628.6949 1705.8594 2940.7254 2954.5461 2961.1750 2964.3527 2966.7999 2970.4170 2980.3894 2988.8854 2992.0171 2997.8025 3011.3551 3015.4139 3025.7801 3047.4008 3058.3255 3062.6659 3067.6694 3072.4663 3075.9485 3076.8527 3083.6969 3096.6464
redmass: 4.0123 3.4940 3.4864 5.1350 3.5472 3.2722 4.1129 3.6351 4.8602 1.1748 1.1668 2.6057 2.5261 1.8342 1.1945 2.2418 2.4328 2.6065 2.2168 2.0544 2.2806 3.5705 2.8110 3.6260 4.0232 3.8036 2.7200 3.2314 3.0447 4.1333 2.2239 1.6415 2.2131 2.8439 2.1946 2.2327 1.6518 1.9128 1.8932 1.5878 2.1214 1.8760 1.7336 1.5423 1.7864 1.7122 1.9653 2.0319 1.5372 1.6392 1.2274 1.9827 2.3506 1.5845 1.7574 1.4514 1.5670 1.2958 1.2794 1.4414 1.3343 1.5194 1.3169 1.5065 1.9043 1.4639 1.3990 1.5433 1.9027 1.2091 1.2408 1.2080 1.0934 1.0912 1.1083 1.0811 1.0494 1.0441 1.0807 1.0593 1.0695 1.0427 1.0524 8.3139 8.6940 6.6373 1.0765 1.0410 1.0635 1.0618 1.0544 1.0596 1.0364 1.0652 1.0616 1.0607 1.0955 1.0959 1.0965 1.1031 1.0998 1.1014 1.0997 1.1004 1.0996 1.0979 1.0996 1.0909
irintensity: 1.4026 0.3586 0.3642 3.9841 3.3476 2.8351 1.4176 1.0450 1.1594 1.6283 0.0108 1.0939 1.1128 12.2090 1.0341 0.9007 0.9230 0.5213 0.1532 0.3613 1.6835 2.4444 1.7950 21.5922 3.0627 0.7676 1.7826 2.3273 7.8351 1.6237 4.4344 13.6776 3.4120 0.0631 3.1211 3.1797 1.6083 4.0248 5.9311 2.3955 0.5756 1.4209 0.4912 3.5050 1.4756 8.7277 64.7927 72.8833 4.2690 29.1805 2.8964 16.2579 68.2978 24.5014 2.1389 15.0620 26.5131 16.8872 11.5554 82.5725 10.1044 79.8772 2.0827 2.4384 6.4786 3.3537 6.3272 3.7168 4.6633 23.3300 11.9211 13.9198 22.0002 11.5077 6.3832 18.9943 9.7492 4.1596 4.6805 4.6547 18.1371 19.7958 11.7755 137.5992 49.8727 1.6443 21.9248 36.5485 65.8477 21.9716 42.8650 26.1477 27.3085 32.4921 24.8106 15.3852 17.3849 33.0878 29.4452 41.9843 17.3543 32.2766 12.8812 0.6620 45.7441 25.8030 42.6890 41.5525
temp: 298.150 k
press: 1.00000 atm
elementType: 8 8 6 6 6 6 6 6 6 6 6 6 6 6 6 6 1 1 1 1 1 1 1 1 1 1 1 1 1 1 1 1 1 1 1 1 1 1
symmnumber: 1
zpe: 859712.9 jmol-1
zpe.correction: 0.327447 hartree
zpe.thermalcorrener: 0.344603 hartree
zpe.thermalcorrenthalpy: 0.345547 hartree
zpe.thermalcorrgfe: 0.281743 hartree
zpe.sumelectzpe: -695.860487 hartree
zpe.sumelectthermal: -695.843332 hartree
zpe.sumelectthermalent: -695.842388 hartree
zpe.sumelectthermalfe: -695.906191 hartree
dipole: -1.1488 -1.0738 -3.1441
dipole: 3.5155
quadrupole: -88.5585 -101.5815 -94.4980
quadrupole: -0.6106 1.4552 3.8716
quadrupole: 6.3208 -6.7022 0.3813 -0.6106 1.4552 3.8716
hfenergy: -696.1879347 hartree
pointgroup: C01 [X(C14H22O2)]
dipole: 0.4030916 0.28789 -1.2913426 debye
polarizability: 168.8907562|6.3832288|146.5851795|-1.1295617|4.8720034|137.9484823 unknown
InChI: InChI=1S/C14H22O2/c1-10(2)7-13(15)9-14(16)12-6-4-5-11(3)8-12/h5,10,12H,4,6-9H2,1-3H3
charge 0 multiplicity 1
38 atoms
O  0.019568 -1.357031 -0.383988
O  1.383156 1.743912 0.446573
C  -1.583762 0.212777 -1.389222
C  -1.850823 1.594024 -0.707381
C  -2.699383 -0.800628 -1.042562
C  -1.986877 1.464432 0.825453
C  -3.181845 -0.738991 0.40211
C  -0.183064 -0.307141 -1.048505
C  -2.854449 0.289165 1.230334
C  1.022573 0.481623 -1.607555
C  3.421349 1.008576 -0.657922
C  4.03798 -0.22987 0.092599
C  1.909077 1.122851 -0.517011
C  -4.040515 -1.904788 0.851599
C  3.582869 -1.584824 -0.501946
C  3.77041 -0.167066 1.613936
H  -1.57376 0.388553 -2.488015
H  -2.79211 1.990402 -1.135056
H  -1.047469 2.315117 -0.949005
H  -2.335284 -1.827007 -1.248444
H  -3.562815 -0.635294 -1.72141
H  -2.412817 2.40356 1.232159
H  -0.977929 1.370446 1.275743
H  -3.211173 0.270211 2.270319
H  0.677859 1.30058 -2.268806
H  1.628463 -0.211235 -2.217868
H  3.865729 1.923634 -0.224336
H  3.699634 0.94634 -1.727663
H  5.132874 -0.137134 -0.066829
H  -4.40537 -1.769949 1.884785
H  -3.46893 -2.853528 0.810171
H  -4.921822 -2.034972 0.191097
H  4.143094 -2.411649 -0.027482
H  2.506529 -1.765704 -0.326706
H  3.774277 -1.635979 -1.591597
H  4.299436 -0.990742 2.127972
H  2.692946 -0.26418 1.836124
H  4.116175 0.789409 2.046834
