program: Gaussian 09
title: 000166356
version: EM64L-G09RevD.01
frameworkgroup: C1[X(C13H22O)]
method: RPBEPBE
basis: SDD
operation: Freq
keyword: #pfreq=noraman
keyword: PBEPBE/SDD
title: #p freq=noraman PBEPBE/SDD
converged: YES YES NO NO
title: Mulliken charges:
elementType: O C C C C C C C C C C C C C H H H H H H H H H H H H H H H H H H H H H H
charge: -0.231877 -0.410555 -0.534673 -0.394573 0.307758 -0.498960 -0.375098 -0.467894 -0.357513 0.021515 -0.283022 -0.354134 -0.355137 -0.695076 0.201944 0.211473 0.213511 0.215946 0.204537 0.212329 0.247999 0.229075 0.207878 0.204438 0.216050 0.210764 0.189816 0.187875 0.269677 0.189428 0.189894 0.194409 0.195554 0.209969 0.210726 0.215946
chargesum: 0.00000
title: Mulliken charges with hydrogens summed into heavy atoms:
elementType: O C C C C C C C C C C C C C
charge: -0.231877 0.002862 -0.105217 0.022293 0.307758 -0.021886 0.037218 -0.041079 0.020178 0.021515 -0.013345 0.025188 0.034826 -0.058435
polarizability: 1.98100664e+02 2.49366279e+00 1.30918585e+02 9.59706381e+00 -1.42212035e+00 1.09819538e+02
1716.lowfreq: -21.4181 -9.3822 -4.2355 -0.0007 0.0001 0.0005 3.6068 31.2070 34.9856
frequency: -12.7556 30.8480 34.8889 50.8489 62.6706 107.0020 108.7596 126.8519 130.6707 204.4317 220.2340 228.2508 263.3022 296.9203 355.2360 379.6343 418.6631 423.1515 457.5660 480.3031 537.3332 591.3560 629.1234 682.3872 719.8674 734.7923 783.2787 814.6439 845.7663 868.8502 883.3547 888.9745 903.3027 928.4223 966.6178 980.9998 1002.8654 1015.6134 1047.2819 1066.3099 1074.6558 1077.4162 1078.3786 1098.8279 1112.4455 1123.5829 1144.9334 1165.9748 1193.1632 1222.3430 1236.8591 1243.7218 1259.0473 1262.8599 1272.6224 1283.1962 1286.3770 1293.3652 1313.6246 1319.1200 1323.9562 1339.2482 1346.6568 1348.0048 1354.0842 1365.9651 1388.4579 1433.7369 1455.3243 1458.5843 1461.8063 1464.7020 1471.4901 1472.8511 1475.7603 1476.5363 1481.1624 1487.6408 1554.3519 1645.8612 2944.9994 2951.3189 2953.7826 2956.1144 2962.5593 2967.1819 2972.5846 2973.1351 2978.1571 2981.4393 2988.2516 3002.6997 3017.6811 3026.8273 3031.0076 3039.0166 3045.7571 3047.2813 3058.0824 3069.2683 3071.7369 3085.1353
redmass: 2.4022 2.0266 2.9878 4.6775 2.6907 2.3284 1.7619 3.4620 2.2493 3.2713 3.1084 1.1608 3.2998 1.7590 3.3602 3.2183 3.6603 2.7902 2.4870 3.4928 3.4068 2.4284 2.8576 3.0568 1.0704 1.1462 1.2499 1.5147 1.7048 2.2381 1.5233 1.8751 1.7030 1.3905 1.9580 1.5802 3.4507 3.0679 2.1869 2.0921 1.9154 1.9615 2.1547 1.5300 2.1657 1.2017 2.2992 2.2906 1.6364 1.2976 1.3797 1.3098 1.4164 1.3361 1.2951 1.1422 1.2794 1.1047 1.5468 1.4339 1.3070 1.4498 1.4904 1.5090 1.6527 1.6802 1.2169 1.0803 1.0872 1.0825 1.0685 1.0763 1.0845 1.0764 1.0906 1.0432 1.0809 1.0874 10.0877 8.2861 1.0653 1.0590 1.0661 1.0589 1.0669 1.0592 1.0404 1.0551 1.0625 1.0616 1.0973 1.1000 1.0970 1.0941 1.1009 1.0981 1.1018 1.1026 1.0954 1.1006 1.0993 1.0884
irintensity: 0.6167 0.1048 0.5035 1.8561 0.1777 1.8181 0.1640 0.0250 0.1180 0.1062 2.4081 0.0948 0.3716 0.3847 1.7458 2.8986 2.2720 0.4401 1.0427 7.5244 1.6754 0.6522 6.0934 12.0691 12.3380 0.1553 7.5848 19.4419 5.4781 9.7868 3.2498 4.3203 23.2901 8.3616 1.6003 16.9973 0.3419 1.5406 16.0593 18.5811 8.3518 0.5460 1.0701 2.5232 12.9830 1.1608 53.6221 1.4836 1.3590 14.8337 10.8181 0.3585 29.3061 22.6241 11.5283 8.5082 17.0384 0.6238 17.8627 4.1892 0.6081 1.9242 1.0707 1.9097 0.7019 2.6823 10.8813 15.9248 3.6211 9.6805 0.1357 0.8173 12.9809 1.4879 7.2786 12.6101 3.9867 22.6136 175.6842 66.5632 9.8210 3.5431 23.4603 9.1802 10.0427 38.6868 25.9233 113.0151 31.3530 41.4852 0.5677 1.2643 5.3360 39.0986 17.2011 57.2677 50.4298 107.1609 30.5005 94.3210 54.8865 8.2841
temp: 298.150 k
press: 1.00000 atm
elementType: 8 6 6 6 6 6 6 6 6 6 6 6 6 6 1 1 1 1 1 1 1 1 1 1 1 1 1 1 1 1 1 1 1 1 1 1
symmnumber: 1
zpe: 838965.6 jmol-1
zpe.correction: 0.319545 hartree
zpe.thermalcorrener: 0.334843 hartree
zpe.thermalcorrenthalpy: 0.335787 hartree
zpe.thermalcorrgfe: 0.275180 hartree
zpe.sumelectzpe: -582.676206 hartree
zpe.sumelectthermal: -582.660909 hartree
zpe.sumelectthermalent: -582.659964 hartree
zpe.sumelectthermalfe: -582.720571 hartree
dipole: 1.0597 -3.5044 0.0826
dipole: 3.6621
quadrupole: -84.8116 -95.4800 -86.5544
quadrupole: 11.7401 2.1588 0.3890
quadrupole: 4.1371 -6.5314 2.3943 11.7401 2.1588 0.3890
hfenergy: -582.9957514 hartree
pointgroup: C01 [X(C13H22O1)]
dipole: -0.4915369 1.0755007 0.8231183 debye
polarizability: 196.8896373|12.3249393|123.7689988|-6.6001922|10.0695838|118.1801507 unknown
InChI: InChI=1S/C13H22O/c1-2-3-4-5-6-9-12-10-7-8-11-13(12)14/h9H,2-8,10-11H2,1H3
charge 0 multiplicity 1
36 atoms
O  2.96945 -1.563804 -1.470886
C  3.123507 2.086926 0.670312
C  2.038401 1.066436 1.086746
C  4.437427 1.360211 0.316703
C  1.844837 -0.06944 0.083343
C  4.2211 0.428426 -0.895333
C  -1.833387 -0.376693 -0.298771
C  -0.628206 -0.560212 0.666186
C  -3.183496 -0.27938 0.44596
C  3.000852 -0.49317 -0.789259
C  0.672367 -0.763568 -0.066356
C  -4.387731 -0.07949 -0.501715
C  -5.74086 0.005996 0.241241
C  -6.938814 0.213453 -0.71061
H  2.779526 2.670872 -0.207233
H  3.286767 2.806668 1.494878
H  1.07864 1.58689 1.263305
H  2.335088 0.629108 2.064079
H  4.778414 0.771095 1.191684
H  5.238644 2.087813 0.087189
H  5.103409 -0.201633 -1.107164
H  4.058384 1.049443 -1.802627
H  -1.676095 0.535739 -0.908167
H  -1.863483 -1.227031 -1.010172
H  -0.578413 0.294918 1.366139
H  -0.825148 -1.460923 1.288489
H  -3.144989 0.560544 1.170988
H  -3.337426 -1.201145 1.045711
H  0.683071 -1.569704 -0.81696
H  -4.238411 0.845945 -1.096475
H  -4.424117 -0.915059 -1.231631
H  -5.701558 0.837188 0.974826
H  -5.891605 -0.921616 0.830517
H  -6.829106 1.151409 -1.287214
H  -7.0169 -0.61808 -1.436302
H  -7.893338 0.267968 -0.155422
