program: Gaussian 09
title: 000166355
version: EM64L-G09RevD.01
frameworkgroup: C1[X(C14H24O)]
method: RPBEPBE
basis: SDD
operation: Freq
keyword: #pfreq=noraman
keyword: PBEPBE/SDD
title: #p freq=noraman PBEPBE/SDD
converged: YES YES NO NO
title: Mulliken charges:
elementType: O C C C C C C C C C C C C C C H H H H H H H H H H H H H H H H H H H H H H H H
charge: -0.232193 -0.411066 -0.535617 -0.395192 0.304720 -0.367656 -0.496438 -0.380348 -0.501938 -0.366599 0.017603 -0.267501 -0.353450 -0.354604 -0.695874 0.211583 0.201599 0.216424 0.215793 0.212407 0.204774 0.205424 0.200375 0.229302 0.248191 0.216952 0.187987 0.219556 0.210735 0.189099 0.185529 0.278621 0.190309 0.187619 0.193837 0.194324 0.209968 0.214796 0.210951
chargesum: 0.00000
title: Mulliken charges with hydrogens summed into heavy atoms:
elementType: O C C C C C C C C C C C C C C
charge: -0.232193 0.002115 -0.103400 0.021989 0.304720 0.038143 -0.018945 0.024591 -0.071647 0.008029 0.017603 0.011120 0.024477 0.033557 -0.060159
polarizability: 1.98673702e+02 -7.83614260e+00 1.46849876e+02 -1.26210160e+01 -1.54579105e+00 1.22430185e+02
1716.lowfreq: -16.8823 -8.2957 -0.0006 -0.0002 0.0005 6.2748 12.0778 19.5397 27.8896
frequency: -7.1958 15.2407 27.4411 41.8469 57.8865 92.3788 98.4433 105.9173 121.0118 145.9393 178.1414 231.0965 244.4722 256.1923 294.3224 339.9734 344.8624 402.7338 417.6484 437.4327 449.8152 513.1461 527.3081 588.6243 626.7606 670.1657 720.3009 734.8350 776.6187 814.5330 832.7427 851.6389 871.8812 877.0138 897.5928 903.5153 932.2109 942.8934 972.5776 994.1206 1005.0219 1046.9700 1061.3319 1074.6293 1077.4350 1080.3159 1088.9069 1102.3203 1108.1254 1123.0651 1142.0827 1145.9474 1190.1251 1215.3859 1232.8830 1240.2075 1248.7199 1261.9433 1268.4238 1274.9890 1280.5935 1289.1403 1295.5866 1307.9747 1313.8650 1321.6941 1331.3571 1339.2290 1346.7291 1352.1107 1358.4881 1369.4683 1388.0497 1434.1982 1457.8964 1460.3926 1461.9035 1465.4717 1466.9361 1469.7262 1473.8097 1474.7485 1476.8813 1482.2628 1487.9902 1554.1252 1644.5713 2949.8544 2952.1476 2953.9471 2957.8991 2960.0316 2964.0451 2966.0616 2969.8751 2971.5164 2977.5138 2980.1402 2986.5490 2999.6886 3012.3779 3028.6203 3030.3515 3038.5148 3040.4779 3045.2192 3046.2539 3058.2030 3068.3854 3070.1318 3098.2154
redmass: 3.0903 1.7999 3.7140 3.0964 3.7521 3.3398 1.7324 2.3105 2.6933 2.1167 3.8963 1.1012 3.3921 2.5267 1.7780 4.1211 3.0623 2.5246 3.3264 2.7329 3.1704 2.4382 3.8018 2.2977 2.8923 2.8033 1.0693 1.1487 1.2886 1.5231 1.6160 2.2535 1.7480 2.0437 1.6994 1.4931 1.9594 1.3824 2.5835 1.2749 3.6897 2.7546 2.5672 1.9438 1.9595 2.3348 1.6389 1.4528 1.8172 1.2409 2.5800 2.2826 1.7009 1.4034 1.3549 1.3333 1.4496 1.2083 1.4373 1.3304 1.0756 1.1610 1.1447 1.4244 1.5838 1.3393 1.4391 1.4288 1.4976 1.6666 1.5351 1.6688 1.2174 1.0802 1.0813 1.0771 1.0664 1.0790 1.1013 1.0888 1.0763 1.0903 1.0427 1.0814 1.0892 9.6965 8.0535 1.0588 1.0667 1.0591 1.0646 1.0614 1.0670 1.0594 1.0602 1.0363 1.0627 1.0613 1.0963 1.0988 1.1016 1.1030 1.0949 1.0979 1.0950 1.1027 1.1018 1.0953 1.1007 1.0993 1.0885
irintensity: 0.3875 0.4377 0.6162 1.7483 0.4894 0.2673 0.1131 1.6026 0.0541 0.2553 0.2474 0.0018 0.3528 2.1221 0.4677 2.2498 0.4437 0.2450 1.1610 1.4233 4.4766 2.4459 5.8122 0.8777 6.4711 15.8621 11.9476 0.2845 10.3812 22.5357 8.8745 12.9420 4.0551 0.3700 5.7533 13.0808 3.6601 11.5689 8.6685 7.5580 5.7258 16.1971 0.3537 2.5175 1.7551 6.6512 2.7305 2.6105 5.3047 1.4890 4.9709 51.0344 0.0501 13.4747 4.4718 8.0999 38.8119 4.1433 40.7735 9.4090 0.2313 2.7540 0.3555 4.0469 19.2975 1.1436 5.1546 1.0771 1.1215 1.4415 8.5786 2.5146 11.1088 15.7545 11.7193 0.7353 0.4178 0.8814 5.8015 16.2221 2.9962 5.5181 12.5112 2.0130 22.4440 153.5484 56.8801 2.0308 17.8771 2.9019 16.9621 10.3230 10.1004 22.5836 149.5060 39.5461 34.6909 41.9229 2.8279 1.7303 3.9523 6.8435 22.3670 61.7578 99.0482 28.1995 115.7337 29.8023 95.8431 55.3805 6.7574
temp: 298.150 k
press: 1.00000 atm
elementType: 8 6 6 6 6 6 6 6 6 6 6 6 6 6 6 1 1 1 1 1 1 1 1 1 1 1 1 1 1 1 1 1 1 1 1 1 1 1 1
symmnumber: 1
zpe: 912579.2 jmol-1
zpe.correction: 0.347583 hartree
zpe.thermalcorrener: 0.364210 hartree
zpe.thermalcorrenthalpy: 0.365154 hartree
zpe.thermalcorrgfe: 0.300536 hartree
zpe.sumelectzpe: -621.897855 hartree
zpe.sumelectthermal: -621.881228 hartree
zpe.sumelectthermalent: -621.880284 hartree
zpe.sumelectthermalfe: -621.944902 hartree
dipole: -0.4831 -3.1431 1.6026
dipole: 3.5610
quadrupole: -85.3486 -99.5427 -94.8280
quadrupole: 3.9424 -5.5780 5.5323
quadrupole: 7.8912 -6.3029 -1.5883 3.9424 -5.5780 5.5323
hfenergy: -622.2454378 hartree
pointgroup: C01 [X(C14H24O1)]
dipole: -0.134698 0.9700108 -1.0018734 debye
polarizability: 197.125396|12.2487384|143.5602274|13.8503353|-7.8287487|127.2681393 unknown
InChI: InChI=1S/C14H24O/c1-2-3-4-5-6-7-10-13-11-8-9-12-14(13)15/h10H,2-9,11-12H2,1H3
charge 0 multiplicity 1
39 atoms
O  -2.181674 -1.822687 1.431905
C  -3.939804 0.27595 -1.796927
C  -2.977479 1.068402 -0.881173
C  -4.808096 -0.685838 -0.96073
C  -2.157499 0.184241 0.058361
C  1.193608 1.554972 -0.449861
C  -3.917356 -1.730292 -0.254294
C  2.198239 0.662614 0.314713
C  -0.154593 1.799618 0.297031
C  3.564831 0.556592 -0.399645
C  -2.712448 -1.149619 0.495188
C  -0.931684 0.53517 0.562064
C  4.567729 -0.363402 0.332744
C  5.936011 -0.465186 -0.379456
C  6.927678 -1.397228 0.350016
H  -4.57585 0.984246 -2.360991
H  -3.360942 -0.305877 -2.542555
H  -3.5849 1.769183 -0.269022
H  -2.307222 1.69783 -1.495083
H  -5.54913 -1.201463 -1.600284
H  -5.380498 -0.105213 -0.209536
H  0.982001 1.105614 -1.44091
H  1.662216 2.542055 -0.642198
H  -3.499509 -2.422709 -1.016588
H  -4.48475 -2.359653 0.454526
H  1.778624 -0.354768 0.442979
H  2.34858 1.070938 1.336288
H  -0.757957 2.530016 -0.272551
H  0.081604 2.274019 1.273621
H  3.409542 0.178541 -1.432125
H  4.005249 1.570694 -0.503246
H  -0.468563 -0.196532 1.240519
H  4.130468 -1.379065 0.430177
H  4.721111 0.008424 1.367582
H  6.376528 0.549013 -0.468936
H  5.779875 -0.828384 -1.415988
H  7.125914 -1.038828 1.377937
H  7.896149 -1.454863 -0.180296
H  6.522395 -2.423928 0.426645
