program: Gaussian 09
title: 000166359
version: EM64L-G09RevD.01
frameworkgroup: C1[X(C18H11Cl2N5O4)]
method: RPBEPBE
basis: SDD
operation: Freq
keyword: #p
keyword: freq=noraman
keyword: PBEPBE/SDD
title: #p freq=noraman PBEPBE/SDD
converged: YES YES NO NO
title: Mulliken charges:
elementType: Cl Cl O O O O N N N N N C C C C C C C C C C C C C C C C C C H H H H H H H H H H H
charge: 0.009970 0.003127 -0.215318 -0.213571 -0.202111 -0.202291 -0.496570 -0.050211 -0.106760 0.021299 0.018311 0.478790 0.489448 -0.416633 -0.359894 -0.416444 -0.350251 0.139629 -0.248657 -0.339550 0.388517 -0.342344 -0.367633 0.481524 0.440521 -0.196672 -0.259614 -0.394320 -0.403037 0.316088 0.235454 0.274634 0.241800 0.278456 0.286518 0.265955 0.291219 0.290541 0.314557 0.315522
chargesum: 0.00000
title: Mulliken charges with hydrogens summed into heavy atoms:
elementType: Cl Cl O O O O N N N N N C C C C C C C C C C C C C C C C C C
charge: 0.009970 0.003127 -0.215318 -0.213571 -0.202111 -0.202291 -0.180482 -0.050211 -0.106760 0.021299 0.018311 0.478790 0.489448 -0.181179 -0.085260 -0.174644 -0.071795 0.139629 0.037861 -0.073595 0.388517 -0.051125 -0.077092 0.481524 0.440521 -0.196672 -0.259614 -0.079763 -0.087515
polarizability: 9.65009260e+02 3.54238451e+00 2.24366434e+02 1.58355096e+01 -1.62841875e+01 1.71900460e+02
1716.lowfreq: -2.9992 0.0007 0.0019 0.0021 1.0583 4.4319 11.6908 17.7898 18.1503
frequency: 11.6098 17.7794 18.1080 34.9478 39.4438 58.0276 59.9877 74.4480 89.2623 106.4340 119.3674 124.5376 147.8558 158.4434 183.5339 194.9827 207.0858 228.0629 247.1514 269.9075 286.8401 320.4751 331.6184 340.7745 351.0474 389.0285 396.2731 414.5239 422.0417 428.0858 463.5384 489.0480 505.1573 507.9159 509.8961 528.4369 543.5415 585.5271 594.6413 597.5525 618.0045 626.7735 656.4772 666.1812 689.8594 698.2564 726.3837 729.7474 738.9306 753.7108 771.4917 781.2887 807.0108 821.6028 837.9555 846.9856 852.5565 870.4200 872.2769 876.1721 909.4663 919.7493 974.6512 982.1598 986.7553 992.7001 995.1681 999.2268 1041.7997 1098.3546 1112.7325 1115.6993 1127.6862 1141.2976 1174.7930 1180.0105 1188.8794 1203.1682 1223.9617 1232.2387 1254.3452 1269.5161 1307.7576 1313.3332 1344.5917 1353.5083 1364.8805 1370.7574 1378.3187 1399.7211 1402.2246 1410.1874 1436.8383 1451.4913 1484.8702 1489.3222 1522.4120 1553.8518 1575.3558 1579.2799 1599.0490 1604.9664 1625.0153 3122.8890 3133.3700 3160.4805 3169.8910 3171.0786 3183.1314 3185.2030 3189.9381 3190.6610 3194.8283 3520.5188
redmass: 11.9206 10.7392 6.9658 9.6484 9.9516 14.7440 5.9466 7.2768 8.6216 7.4824 10.6011 9.1078 7.5987 16.3091 9.1642 13.3558 4.9011 8.5837 8.2936 7.4566 6.5843 8.3828 5.5379 22.5853 10.9461 5.6338 7.7177 3.0915 5.7530 3.8200 7.2022 2.8677 4.6253 5.9408 5.7027 4.1574 3.8722 3.2433 1.8942 5.5791 6.7579 7.1467 6.2417 5.7289 9.9603 6.9815 5.1875 5.0628 5.1638 10.6964 6.3684 7.4108 5.5562 1.2927 1.4577 1.6727 5.4631 2.5011 2.4100 8.0018 1.3552 1.4750 1.3484 1.3387 1.3497 2.6640 2.2083 1.5855 2.6471 3.0503 1.5101 2.5245 1.2909 2.2916 1.5264 1.5964 1.6702 7.2524 3.6993 3.1298 3.6442 1.4407 1.3414 1.8387 4.6805 5.3620 10.1093 6.0990 7.9414 5.1431 6.9596 4.6139 4.7299 4.1421 2.5320 2.3529 2.9076 9.6615 5.1296 7.9102 4.0584 6.4135 6.4789 1.0901 1.0908 1.0891 1.0943 1.0895 1.0961 1.0948 1.0928 1.0965 1.0934 1.0754
irintensity: 1.5078 0.8986 0.7188 0.7101 0.9641 0.0530 0.8548 0.3992 0.6929 1.0954 0.4939 3.1567 9.5545 2.3359 3.2097 0.5227 0.0463 7.1741 3.0720 7.6085 12.6250 8.7183 2.1029 0.2322 4.6711 6.7479 2.9033 0.7297 11.1325 1.8042 1.2147 75.0367 45.1676 5.2108 2.4248 37.7324 36.9089 134.5362 54.9172 5.0845 0.9102 1.5808 7.2680 21.5637 26.8273 15.0035 5.5978 6.5089 11.1658 70.3833 9.6178 15.0207 50.4384 35.4681 8.8388 143.7116 38.1177 26.3003 5.7968 225.3598 3.3574 42.9919 8.7978 0.9517 1.5194 0.6429 0.6424 0.3884 111.6014 36.3698 5.2473 20.2322 37.1927 1080.2284 170.6356 293.8383 47.5856 1358.7441 636.6874 16.1428 1.9020 26.5249 11.5581 294.7908 4.1837 288.7719 663.0995 150.9737 124.4744 79.8978 74.2564 47.6913 11.0499 12.0091 1.6244 69.8636 677.4647 45.9698 44.5489 101.5706 49.9080 986.0747 23.7646 18.4476 8.2936 3.3501 1.4451 3.8515 8.4084 4.3073 9.9348 0.9442 13.9262 40.8730
temp: 298.150 k
press: 1.00000 atm
elementType: 17 17 8 8 8 8 7 7 7 7 7 6 6 6 6 6 6 6 6 6 6 6 6 6 6 6 6 6 6 1 1 1 1 1 1 1 1 1 1 1
symmnumber: 1
zpe: 697142.4 jmol-1
zpe.correction: 0.265528 hartree
zpe.thermalcorrener: 0.290636 hartree
zpe.thermalcorrenthalpy: 0.291580 hartree
zpe.thermalcorrgfe: 0.205604 hartree
zpe.sumelectzpe: -2185.065246 hartree
zpe.sumelectthermal: -2185.040138 hartree
zpe.sumelectthermalent: -2185.039193 hartree
zpe.sumelectthermalfe: -2185.125169 hartree
dipole: -3.1561 3.0682 -3.8427
dipole: 5.8430
quadrupole: -306.4608 -177.5292 -173.6225
quadrupole: -11.2192 20.3119 -6.3050
quadrupole: -87.2567 41.6750 45.5817 -11.2192 20.3119 -6.3050
hfenergy: -2185.3307734 hartree
pointgroup: C01 [X(C18H11Cl2N5O4)]
dipole: 1.2685279 1.4700387 -1.2306204 debye
polarizability: 963.8761109|22.2681651|170.9305292|25.2689693|-13.3843684|226.4695148 unknown
InChI: InChI=1S/C18H11Cl2N5O4/c19-16-9-15(25(28)29)10-17(20)18(16)23-22-13-3-1-11(2-4-13)21-12-5-7-14(8-6-12)24(26)27/h1-10,21H
charge 0 multiplicity 1
40 atoms
Cl -3.751322 0.949502 2.496132
Cl -4.252264 -0.845831 -2.804957
O  9.602581 0.05048 0.886369
O  8.63252 -1.908999 1.551129
O  -8.852917 -0.016712 1.567827
O  -9.083647 -0.723212 -0.593337
N  3.53966 1.233544 -0.775753
N  -1.842921 -0.108135 0.368976
N  -2.756098 0.252327 -0.49672
N  8.576984 -0.725749 1.030341
N  -8.372258 -0.321973 0.407969
C  2.214663 0.864736 -0.481299
C  4.755787 0.714997 -0.290462
C  1.195528 1.275753 -1.399899
C  1.841156 0.16142 0.701379
C  5.920707 1.531507 -0.409789
C  4.881709 -0.597967 0.251862
C  -0.516778 0.258262 0.015526
C  -0.147644 0.980059 -1.160027
C  0.490959 -0.136982 0.936591
C  7.266706 -0.231634 0.572497
C  7.171504 1.064909 0.01589
C  6.132143 -1.066793 0.683513
C  -4.107562 0.024257 -0.157302
C  -6.910859 -0.203788 0.212047
C  -4.726543 0.335157 1.096004
C  -4.980004 -0.404742 -1.206133
C  -6.11211 0.236965 1.287401
C  -6.362275 -0.534682 -1.046379
H  3.63505 2.000379 -1.446433
H  1.482294 1.815019 -2.311433
H  2.590327 -0.105094 1.449964
H  5.832833 2.542175 -0.825746
H  4.01842 -1.265884 0.289487
H  -0.930586 1.278797 -1.863482
H  0.181565 -0.664802 1.844119
H  8.070537 1.681418 -0.062205
H  6.249983 -2.074664 1.090202
H  -6.578854 0.486709 2.242957
H  -7.011072 -0.879732 -1.854025
