program: Gaussian 09
title: 000166278
version: EM64L-G09RevD.01
frameworkgroup: C1[X(C10H16O2)]
method: RPBEPBE
basis: SDD
operation: Freq
keyword: #pfreq=noraman
keyword: PBEPBE/SDD
title: #p freq=noraman PBEPBE/SDD
converged: YES YES NO NO
title: Mulliken charges:
elementType: O O C C C C C C C C C C H H H H H H H H H H H H H H H H
charge: -0.266547 -0.243923 -0.453086 -0.503825 -0.166974 0.250779 -0.179124 -0.526924 -0.227038 -0.672551 -0.016569 -0.580519 0.227570 0.221542 0.242904 0.260666 0.220283 0.224702 0.213238 0.208228 0.227303 0.227597 0.211091 0.230087 0.229497 0.210440 0.215134 0.216019
chargesum: 0.00000
title: Mulliken charges with hydrogens summed into heavy atoms:
elementType: O O C C C C C C C C C C
charge: -0.266547 -0.243923 -0.003974 -0.000255 0.053309 0.250779 0.045578 -0.105458 0.227863 -0.001876 0.193871 -0.149367
polarizability: 1.53385782e+02 -8.57827222e+00 1.09071167e+02 2.83218594e+00 5.60680856e+00 9.00841353e+01
1716.lowfreq: -1.1777 -0.0006 0.0005 0.0006 4.5259 6.4879 13.2046 29.0723 43.2435
frequency: 11.2669 28.8731 43.1946 56.7242 67.5742 73.0566 128.9144 143.5712 149.1412 196.8706 227.6298 251.2870 290.4994 354.4765 359.3914 413.5977 439.5722 502.2176 551.2143 626.0040 677.1482 767.5805 796.2299 799.1170 812.2257 902.5035 911.6109 920.6150 941.7730 966.0891 981.4183 1001.0108 1019.5885 1047.0181 1049.8235 1092.7326 1112.4277 1118.9839 1127.4982 1136.2067 1175.7197 1202.8511 1248.0280 1249.5062 1263.0367 1276.7416 1286.2840 1299.9293 1322.7916 1350.7695 1363.0907 1399.9121 1426.3544 1440.0570 1451.4139 1463.3396 1464.6259 1474.2304 1487.3271 1638.8836 1657.3048 1688.6361 2940.6803 2986.7245 2993.6311 2995.5032 3008.9047 3036.2296 3039.7838 3058.5102 3067.0090 3069.6771 3076.1391 3082.2149 3092.1442 3094.6117 3107.1714 3194.8000
redmass: 3.8533 4.1358 3.3273 2.5525 2.1677 2.9756 2.4921 1.9381 2.5683 2.6169 3.4735 1.2858 4.7332 3.0693 2.5289 2.1885 3.3658 2.7451 2.6034 1.4631 4.8396 1.4056 1.6583 1.1861 3.4608 1.7238 3.4207 2.0550 1.3845 1.3124 1.5518 1.1504 2.3587 1.8849 3.5943 2.7139 2.3139 1.5312 2.9599 1.4655 1.7664 1.3126 1.3102 1.1356 1.1988 1.2812 1.2494 1.2354 1.3678 1.4109 1.5977 1.2667 1.1833 1.0825 1.0955 1.0403 1.0914 1.0586 1.0698 9.7155 4.7260 6.5691 1.0655 1.0620 1.0632 1.0360 1.0581 1.0928 1.0948 1.0949 1.1066 1.0972 1.0806 1.0783 1.0985 1.0834 1.1025 1.1146
irintensity: 0.6558 0.2263 0.4270 0.1183 0.3502 0.3692 0.5786 4.2644 2.8701 4.1576 3.5806 1.7233 8.4297 3.8182 5.5657 2.8659 2.9832 9.0669 2.1631 18.9556 2.1132 9.2460 4.8130 2.3877 4.5158 3.7153 17.8114 9.8700 81.2583 23.5511 30.5106 17.3978 26.7519 50.5938 40.5790 3.2437 28.1844 9.5196 315.1123 5.6692 19.6708 2.6827 24.6328 0.0105 19.1046 27.5143 2.4283 0.5494 30.9489 6.4170 15.8162 18.3880 4.3096 23.4380 15.7904 12.0286 17.8949 5.2688 13.4614 176.2753 18.5728 0.1613 32.3316 8.2890 15.5207 24.5328 21.2878 9.1785 1.1036 3.7635 7.2255 19.8817 6.0314 79.4817 31.4386 12.0207 46.0958 31.3089
temp: 298.150 k
press: 1.00000 atm
elementType: 8 8 6 6 6 6 6 6 6 6 6 6 1 1 1 1 1 1 1 1 1 1 1 1 1 1 1 1
symmnumber: 1
zpe: 619493.6 jmol-1
zpe.correction: 0.235953 hartree
zpe.thermalcorrener: 0.250825 hartree
zpe.thermalcorrenthalpy: 0.251769 hartree
zpe.thermalcorrgfe: 0.190234 hartree
zpe.sumelectzpe: -540.123137 hartree
zpe.sumelectthermal: -540.108265 hartree
zpe.sumelectthermalent: -540.107320 hartree
zpe.sumelectthermalfe: -540.168856 hartree
dipole: 0.4769 1.4984 0.3503
dipole: 1.6110
quadrupole: -64.6898 -79.7401 -68.9492
quadrupole: 6.2602 1.1055 -1.1351
quadrupole: 6.4365 -8.6137 2.1772 6.2602 1.1055 -1.1351
hfenergy: -540.3590898 hartree
pointgroup: C01 [X(C10H16O2)]
dipole: -0.1854813 0.5881536 -0.1463102 debye
polarizability: 153.4492148|8.4535072|108.841847|2.6810289|-5.8899293|90.2500222 unknown
InChI: InChI=1S/C10H16O2/c1-3-5-6-7-8-9-10(11)12-4-2/h3,6-7H,1,4-5,8-9H2,2H3
charge 0 multiplicity 1
28 atoms
O  -3.08585 0.629019 -0.125084
O  -2.628981 -1.606899 0.347521
C  0.213299 -1.204836 -0.055866
C  -0.804464 -0.078024 -0.352194
C  1.605029 -0.84355 -0.530046
C  -2.231087 -0.470774 -0.000225
C  2.706772 -0.779497 0.260912
C  4.105034 -0.425037 -0.220128
C  -4.531348 0.375526 0.16893
C  -5.262833 1.695391 -0.052494
C  4.685092 0.771508 0.518146
C  5.159971 1.896948 -0.070764
H  -0.137347 -2.130083 -0.554338
H  0.222143 -1.422724 1.027832
H  -0.783279 0.192242 -1.427015
H  -0.5442 0.847529 0.193436
H  1.70973 -0.620293 -1.604817
H  2.604053 -0.994958 1.336656
H  4.772747 -1.298754 -0.052283
H  4.096998 -0.231053 -1.308786
H  -4.887374 -0.426358 -0.50315
H  -4.614937 0.012364 1.209321
H  -6.341195 1.565442 0.152603
H  -4.873223 2.479388 0.61912
H  -5.146176 2.040602 -1.094005
H  4.707401 0.690684 1.616486
H  5.569401 2.725177 0.518669
H  5.151224 2.02322 -1.160639
