program: Gaussian 09
title: 000166259
version: EM64L-G09RevD.01
frameworkgroup: C1[X(C12H18O2)]
method: RPBEPBE
basis: SDD
operation: Freq
keyword: #pfreq=noraman
keyword: PBEPBE/SDD
title: #p freq=noraman PBEPBE/SDD
converged: YES YES NO NO
title: Mulliken charges:
elementType: O O C C C C C C C C C C C C H H H H H H H H H H H H H H H H H H
charge: -0.308011 -0.241756 0.259705 -0.492904 -0.496597 -0.393624 -0.388459 -0.392481 0.250172 0.275236 -0.191959 -0.690042 -0.689026 -0.525197 0.210047 0.229801 0.272149 0.211020 0.199860 0.220883 0.207791 0.202994 0.204748 0.191738 0.238520 0.217962 0.236738 0.217168 0.216592 0.226187 0.234968 0.285777
chargesum: 0.00000
title: Mulliken charges with hydrogens summed into heavy atoms:
elementType: O O C C C C C C C C C C C C
charge: -0.308011 -0.241756 0.259705 -0.053056 -0.013428 0.027119 0.022326 0.004005 0.250172 0.275236 0.046561 -0.018175 -0.011279 -0.239420
polarizability: 1.38263555e+02 -8.70789230e-01 1.44347850e+02 -1.65311185e+00 1.91565783e+00 1.08917097e+02
1716.lowfreq: -23.9311 -11.2780 -0.0006 0.0003 0.0006 5.8364 18.6894 46.0733 69.2663
frequency: -22.8901 45.9736 69.1295 102.4004 115.7862 131.3650 186.6281 196.8026 203.9787 232.3191 239.4510 260.6782 289.0098 307.4653 335.1026 370.9022 408.2445 431.7823 463.0944 502.3716 523.2909 550.1475 626.6183 648.8511 670.3350 688.0708 715.3897 772.6725 786.9940 819.8521 845.5268 880.2998 911.0111 914.8009 927.9563 930.1873 952.5048 962.8330 1048.7324 1065.6328 1084.2820 1097.3792 1099.9240 1102.2739 1107.8374 1142.1033 1146.7810 1174.8123 1209.3086 1253.2830 1273.3230 1274.9499 1307.5091 1323.3162 1334.3156 1338.6287 1343.3336 1345.1817 1360.5879 1375.7490 1393.9236 1447.7193 1459.3626 1459.7128 1462.9808 1467.9547 1471.6128 1473.9301 1476.9340 1490.2341 1639.3808 2137.1765 2967.2511 2983.8328 2984.6654 2985.5786 2991.2878 2994.1351 2999.7527 3033.7520 3037.2849 3044.0633 3053.2020 3068.1429 3080.1309 3084.7079 3088.2883 3089.3017 3097.2468 3430.1144
redmass: 2.9829 3.4699 5.0542 3.4819 3.4481 3.7596 3.1457 1.5117 1.4440 2.5842 1.2877 3.8627 3.1445 2.4215 2.5169 2.1548 3.2857 3.2920 3.3910 4.8103 1.8086 4.8743 1.2340 3.0852 1.2551 5.5273 7.0006 1.5094 2.8709 3.7321 2.3404 1.7851 2.3583 2.2964 1.1661 1.6669 2.5143 1.4561 1.9758 1.5951 3.1712 1.5229 1.7862 2.6711 2.9723 2.4370 1.6851 1.8835 1.8740 1.3250 1.2545 1.2449 1.3156 1.3663 1.6577 1.3690 1.5265 1.4753 1.4545 1.1880 1.2050 1.0863 1.0876 1.0846 1.0445 1.0800 1.0493 1.0920 1.0494 1.0584 9.3041 6.0507 1.0630 1.0345 1.0626 1.0349 1.0605 1.0658 1.0640 1.0960 1.0856 1.1011 1.1012 1.1019 1.1005 1.1001 1.0966 1.1010 1.0996 1.1595
irintensity: 0.4764 1.3598 0.5636 0.8588 0.2531 1.6242 0.5543 0.4275 0.0888 0.5693 2.6454 2.5193 8.3844 2.4170 1.8722 0.3980 0.5439 4.4007 1.1212 3.0072 2.3301 10.9814 68.7595 0.6165 55.8817 3.0345 5.7969 1.8571 21.0724 16.2200 10.3999 54.5267 9.8595 10.9743 4.6351 17.5739 9.1431 0.2655 12.6449 57.7649 336.8242 28.2594 14.0490 9.4791 12.7477 15.0471 2.8571 3.5607 2.1266 4.5097 4.7893 3.3283 0.2644 1.0253 31.1880 1.1008 4.3224 1.6679 4.3728 16.0296 28.0937 8.3366 13.8503 6.1468 7.4197 23.2936 2.0217 7.1983 17.2398 23.6104 128.3501 0.1090 40.1325 32.1119 28.4567 24.7977 21.8390 18.8164 33.5954 59.0107 4.6722 41.0528 50.2387 45.6128 23.4628 42.5860 9.0169 6.4347 46.7936 65.4921
temp: 298.150 k
press: 1.00000 atm
elementType: 8 8 6 6 6 6 6 6 6 6 6 6 6 6 1 1 1 1 1 1 1 1 1 1 1 1 1 1 1 1 1 1
symmnumber: 1
zpe: 713110.3 jmol-1
zpe.correction: 0.271609 hartree
zpe.thermalcorrener: 0.286114 hartree
zpe.thermalcorrenthalpy: 0.287058 hartree
zpe.thermalcorrgfe: 0.230971 hartree
zpe.sumelectzpe: -617.377430 hartree
zpe.sumelectthermal: -617.362926 hartree
zpe.sumelectthermalent: -617.361982 hartree
zpe.sumelectthermalfe: -617.418069 hartree
dipole: 0.9300 -1.1417 -1.4217
dipole: 2.0469
quadrupole: -78.8131 -79.9174 -88.1035
quadrupole: 2.0835 4.0059 -1.4534
quadrupole: 3.4649 2.3606 -5.8255 2.0835 4.0059 -1.4534
hfenergy: -617.6490395 hartree
pointgroup: C01 [X(C12H18O2)]
dipole: -0.3960594 0.4167811 -0.563868 debye
polarizability: 138.4127962|-1.211075|144.1484228|1.5657639|-2.428241|108.9672835 unknown
InChI: InChI=1S/C12H18O2/c1-4-12(8-6-5-7-9-12)14-11(13)10(2)3/h1,10H,5-9H2,2-3H3
charge 0 multiplicity 1
32 atoms
O  0.266888 0.105509 -0.500706
O  1.596612 -0.382468 1.371439
C  -0.952527 -0.652166 0.024956
C  -1.991698 -0.455703 -1.113218
C  -1.45447 -0.022855 1.355316
C  -2.411057 1.023294 -1.274004
C  -1.86818 1.455181 1.177994
C  -2.92314 1.618367 0.058715
C  -0.611525 -2.076214 0.179785
C  1.451233 0.144291 0.246111
C  2.53372 0.91486 -0.511256
C  2.992159 2.129721 0.335236
C  3.721073 -0.038566 -0.807833
C  -0.391491 -3.284169 0.275382
H  -2.873769 -1.077377 -0.864947
H  -1.56377 -0.849364 -2.052396
H  -0.677294 -0.137743 2.127669
H  -2.332817 -0.617942 1.675784
H  -3.192104 1.095689 -2.054964
H  -1.540394 1.608073 -1.626282
H  -0.975567 2.063517 0.931338
H  -2.261171 1.837619 2.139187
H  -3.175135 2.687631 -0.075761
H  -3.857808 1.100457 0.359017
H  2.096846 1.266616 -1.462506
H  3.796982 2.673802 -0.191073
H  3.378955 1.790325 1.312388
H  2.161844 2.835976 0.517725
H  4.516014 0.507866 -1.346703
H  3.407052 -0.895753 -1.429906
H  4.14079 -0.43067 0.135399
H  -0.173654 -4.330204 0.385913
