program: Gaussian 09
title: 000166246
version: EM64L-G09RevD.01
frameworkgroup: C1[X(C12H16O3)]
method: RPBEPBE
basis: SDD
operation: Freq
keyword: #pfreq=noraman
keyword: PBEPBE/SDD
title: #p freq=noraman PBEPBE/SDD
converged: YES YES NO NO
title: Mulliken charges:
elementType: O O O C C C C C C C C C C C C H H H H H H H H H H H H H H H H
charge: -0.281989 -0.271115 -0.230810 -0.141949 0.341446 -0.257483 -0.523841 -0.204497 -0.529512 -0.271233 -0.227470 -0.230789 -0.789792 0.238799 -0.501234 0.236479 0.254449 0.237602 0.253260 0.238735 0.253757 0.218113 0.252366 0.242931 0.284410 0.220781 0.223046 0.243910 0.240285 0.234927 0.246417
chargesum: 0.00000
title: Mulliken charges with hydrogens summed into heavy atoms:
elementType: O O O C C C C C C C C C C C C
charge: -0.281989 -0.271115 -0.230810 0.094530 0.341446 -0.003034 -0.032979 0.034239 -0.057643 -0.018867 0.015461 0.013120 -0.061556 0.238799 0.220396
polarizability: 1.47336708e+02 7.14969159e+00 1.28354837e+02 5.36295267e+00 -4.90755659e+00 1.09684399e+02
1716.lowfreq: -10.8915 -0.0010 -0.0004 0.0003 5.3977 10.9123 29.5383 53.8136 62.0488
frequency: 29.1292 53.7763 62.0042 78.5834 102.3817 139.9660 158.5234 173.1968 221.2843 251.1496 272.3281 328.3144 338.2791 369.9401 406.3737 432.5650 478.0292 481.8298 517.1429 642.5427 668.8969 683.5778 705.1506 733.6198 755.9291 770.0542 806.3544 823.9429 829.6718 867.4885 899.3389 907.8937 926.2217 936.3609 946.5654 954.9590 963.0518 983.7002 1003.6338 1020.8839 1048.1364 1062.5923 1069.5154 1087.3170 1109.2630 1113.3367 1126.5290 1136.5622 1147.8663 1152.3448 1180.3250 1221.8165 1224.5245 1258.2575 1261.6778 1266.5825 1287.0709 1298.1217 1328.4176 1356.2958 1387.6653 1395.0953 1422.8785 1451.3423 1463.4805 1466.7752 1470.1454 1478.7581 1488.7009 1579.5214 1646.8487 2983.8690 2988.0993 3004.3038 3006.8998 3023.4409 3072.3054 3078.4630 3082.5183 3087.1239 3090.0849 3105.5303 3115.1427 3136.1806 3150.9365 3151.9992 3185.3323
redmass: 3.9884 4.3009 2.8966 1.2224 3.2745 3.4678 1.8208 1.8588 3.9386 3.6906 4.3401 3.1590 4.5653 3.1660 4.5505 2.6787 3.2945 2.0904 3.5639 4.5645 4.1988 5.6012 3.7379 1.8221 4.4902 4.6644 3.0015 3.3149 2.2455 6.1926 3.4539 2.5486 1.5190 2.7612 2.0930 1.8794 2.3108 2.5535 1.9149 1.4437 1.4561 1.8098 1.9813 1.1687 1.1908 1.2795 2.1993 1.3695 1.4277 1.6503 1.4141 1.6642 2.1052 1.4455 1.3567 1.5168 1.8708 1.5286 1.7570 1.5632 2.3279 1.2571 1.2061 1.0497 1.0518 1.1083 1.1003 1.0512 1.0930 5.6722 9.2374 1.0766 1.0435 1.0297 1.0608 1.0632 1.0976 1.0888 1.1000 1.0995 1.0997 1.1044 1.0988 1.0880 1.1047 1.0873 1.1095
irintensity: 1.3555 0.8865 0.4182 0.4428 0.4656 1.3916 1.9551 2.0209 1.6155 7.6990 7.6605 2.3838 4.3231 13.3478 2.0611 3.7289 1.8351 2.4162 3.9582 7.2994 1.6204 14.8087 25.0977 60.5947 7.8145 4.0568 7.1706 10.5176 8.6357 6.4108 4.5594 1.3535 5.9933 4.6073 5.6065 4.1848 2.9413 17.7463 24.6729 11.0505 4.3777 40.8441 5.1978 3.0234 10.2797 4.2437 228.2741 37.4126 9.6771 8.2210 1.1666 12.2252 12.8576 3.3323 2.5334 4.8478 12.8593 0.0350 16.2940 0.3275 99.2001 36.8284 31.8368 14.2678 13.1774 0.4893 11.4632 21.6937 6.1448 2.0331 150.6395 7.6163 33.7250 35.3246 46.7221 30.9945 23.5989 60.9202 8.8993 45.5746 27.1015 25.0305 2.2326 7.1050 14.3091 7.1273 14.2307
temp: 298.150 k
press: 1.00000 atm
elementType: 8 8 8 6 6 6 6 6 6 6 6 6 6 6 6 1 1 1 1 1 1 1 1 1 1 1 1 1 1 1 1
symmnumber: 1
zpe: 669757.0 jmol-1
zpe.correction: 0.255097 hartree
zpe.thermalcorrener: 0.269622 hartree
zpe.thermalcorrenthalpy: 0.270566 hartree
zpe.thermalcorrgfe: 0.212744 hartree
zpe.sumelectzpe: -691.322788 hartree
zpe.sumelectthermal: -691.308263 hartree
zpe.sumelectthermalent: -691.307319 hartree
zpe.sumelectthermalfe: -691.365141 hartree
dipole: -1.3350 2.3907 1.5926
dipole: 3.1676
quadrupole: -83.2627 -90.0091 -89.4645
quadrupole: 13.1717 3.4925 -4.5895
quadrupole: 4.3161 -2.4303 -1.8857 13.1717 3.4925 -4.5895
hfenergy: -691.577885 hartree
pointgroup: C01 [X(C12H16O3)]
dipole: -0.6159963 -1.0236612 -0.3546258 debye
polarizability: 145.6890688|-10.1325338|126.2089075|-4.8827007|-8.2886598|113.4779675 unknown
InChI: InChI=1S/C12H16O3/c1-12(10(15-12)11(13)14-2)9-6-7-3-4-8(9)5-7/h3-4,7-10H,5-6H2,1-2H3
charge 0 multiplicity 1
31 atoms
O  0.873362 1.775154 0.803795
O  2.630325 -1.445478 0.389242
O  3.315278 0.579569 -0.546897
C  -1.360069 1.031305 -0.258666
C  0.159623 1.166413 -0.394464
C  -1.991954 -0.136282 -1.141968
C  -1.951828 0.740116 1.165331
C  -2.894318 -0.505802 0.917664
C  -3.421165 -0.179889 -0.51593
C  1.071928 0.323332 0.477547
C  -1.423937 -1.464948 -0.626258
C  -1.970171 -1.688725 0.605389
C  0.644738 1.692436 -1.736017
C  2.444096 -0.100106 0.039816
C  3.938431 -2.027031 0.001952
H  -1.782976 1.985504 -0.633058
H  -1.923861 0.037078 -2.226584
H  -2.536855 1.604654 1.524894
H  -1.176543 0.53877 1.922164
H  -3.643884 -0.668231 1.706768
H  -4.044279 -0.986548 -0.936901
H  -3.957599 0.785401 -0.577217
H  0.605727 -0.376486 1.178904
H  -0.646879 -2.052635 -1.122442
H  1.734635 1.846518 -1.72983
H  0.389628 0.985591 -2.546989
H  0.151388 2.656075 -1.957998
H  -1.724622 -2.493413 1.304223
H  4.070811 -1.978254 -1.092222
H  3.897365 -3.0678 0.351619
H  4.758709 -1.473488 0.488832
