program: Gaussian 09
title: 000166390
version: EM64L-G09RevD.01
frameworkgroup: C1[X(C22H26N6O2S)]
method: RPBEPBE
basis: SDD
operation: Freq
keyword: #p
keyword: freq=noraman
keyword: PBEPBE/SDD
title: #p freq=noraman PBEPBE/SDD
converged: YES YES NO NO
title: Mulliken charges:
elementType: S O O N N N N N N C C C C C C C C C C C C C C C C C C C C C C H H H H H H H H H H H H H H H H H H H H H H H H H H
charge: 1.006524 -0.514469 -0.557354 -0.132905 -0.674792 -0.119045 -0.090161 -0.027018 -0.085784 -0.407982 -0.424794 0.495188 -0.355325 -0.346767 -0.509443 -0.349299 0.326295 -0.674282 -0.679004 0.003451 -0.297323 -0.743806 -0.106787 0.307342 0.306989 0.484648 -0.503672 -0.574549 -0.801637 -0.235432 -0.174697 0.225236 0.226419 0.236443 0.221883 0.229618 0.208049 0.248174 0.196942 0.316732 0.238992 0.210274 0.213578 0.228960 0.198208 0.240061 0.225811 0.285670 0.385555 0.329248 0.279384 0.274414 0.264282 0.263497 0.230424 0.238882 0.239152
chargesum: 0.00000
title: Mulliken charges with hydrogens summed into heavy atoms:
elementType: S O O N N N N N N C C C C C C C C C C C C C C C C C C C C C C
charge: 1.006524 -0.514469 -0.557354 -0.132905 -0.289237 -0.119045 -0.090161 -0.027018 -0.085784 0.043673 0.033531 0.495188 0.082342 0.098349 -0.192711 -0.110306 0.326295 -0.021470 -0.014925 0.003451 -0.011653 0.139241 -0.106787 0.307342 0.306989 0.484648 -0.239390 -0.311052 -0.093178 -0.235432 -0.174697
polarizability: 7.36438147e+02 -5.10107646e+00 4.01131423e+02 3.49605152e+00 1.46263663e+01 1.75949285e+02
1716.lowfreq: -10.3110 -5.8266 -2.9809 -0.0015 -0.0010 0.0012 16.4524 19.8212 20.4073
frequency: 15.6943 19.8026 20.3914 30.4893 32.6698 37.7974 38.3666 53.9225 57.1255 64.0805 80.4360 87.9710 95.4484 107.0269 112.2228 122.5280 128.9008 164.6049 172.5312 175.8452 184.3852 188.6061 197.4301 204.8060 208.3632 217.9616 228.9085 233.6808 247.0903 253.1852 281.2295 287.7354 302.1665 311.9545 325.7668 339.4841 343.1819 361.9826 379.7484 383.4945 396.3654 415.7812 437.3353 459.4701 466.9636 483.5101 500.3471 506.6756 521.2930 553.8424 570.2901 582.8146 585.7956 599.9612 620.4995 633.1314 638.4859 657.3940 709.7463 737.6501 747.3256 753.6180 785.8725 794.3327 802.3454 809.6387 826.2370 856.3981 866.3901 871.1126 882.1920 886.7529 889.7541 900.5896 900.9101 923.9203 937.2221 954.3588 965.8468 979.5496 990.8113 1010.3558 1014.1999 1041.8488 1044.8117 1047.3896 1051.1425 1088.2341 1100.1089 1105.2810 1110.3615 1149.6204 1160.3356 1185.3048 1198.2899 1203.8494 1235.5895 1246.2001 1254.5969 1283.7057 1288.8976 1291.9130 1293.9906 1297.3390 1299.9885 1300.3563 1310.0038 1327.8697 1333.3998 1350.6352 1351.9642 1360.2653 1382.9430 1393.6979 1395.5614 1397.7463 1404.3870 1411.1577 1422.6398 1436.1263 1439.2797 1469.3775 1472.3390 1474.4821 1476.2072 1476.6032 1477.7634 1481.5133 1484.9298 1492.5822 1500.5180 1504.3374 1522.3505 1524.8781 1556.3410 1598.7922 1623.2485 2143.4552 2178.0006 2976.9372 2977.0769 2982.1036 2987.2545 2988.3997 2998.9174 3001.7309 3014.8172 3031.8191 3038.2373 3054.0737 3059.5752 3061.1929 3075.3472 3077.9831 3083.4817 3085.7878 3091.6141 3140.9779 3148.1045 3156.3544 3162.6851 3177.5319 3184.8013 3189.0846 3317.6993
redmass: 4.4714 7.3521 5.1814 3.3436 1.1630 3.5888 4.1661 4.2902 5.7511 5.4878 2.4165 3.5013 3.1063 2.5720 6.0637 4.5915 5.8535 4.5769 5.7636 4.4833 5.3389 2.1167 4.3323 1.5841 1.3728 1.4592 3.0492 3.6182 3.4528 3.8713 6.1237 2.6614 3.5896 3.9421 4.8506 4.9690 7.4404 5.8565 6.0330 8.6313 3.6587 4.8153 8.2461 7.0646 3.9152 5.3656 5.4597 6.7620 6.2103 5.0027 4.5164 3.4040 4.8828 6.4627 3.7237 6.4808 4.2582 5.4930 4.5131 3.9512 1.0897 1.1140 1.9857 3.6240 5.8098 1.7381 3.5317 1.8783 3.9268 1.4656 1.5341 1.5594 1.4587 2.9829 1.7263 3.3223 1.3911 5.6486 5.2124 1.3285 2.2174 1.4298 1.6229 1.4933 3.0291 2.9574 1.5596 1.9903 2.1151 2.1633 2.3831 2.5926 1.7054 1.8893 1.9973 2.1352 1.4208 1.6661 1.3112 1.3066 5.3845 1.3301 1.8401 1.5243 1.2867 1.4537 1.5550 1.2304 4.4645 1.3549 1.5499 6.2226 2.8966 1.2155 1.2057 1.8326 1.7188 2.8541 1.0690 3.4906 1.1241 1.0451 1.0843 1.0521 1.1215 1.0804 1.0536 1.0717 1.0907 1.3242 2.1400 1.8952 3.4173 2.0616 6.2271 5.5299 6.0786 12.6000 12.6344 1.0365 1.0364 1.0375 1.0611 1.0618 1.0604 1.0604 1.0261 1.0996 1.0979 1.1038 1.1032 1.0977 1.1023 1.1015 1.0989 1.1000 1.0989 1.0925 1.0931 1.0874 1.1070 1.0958 1.0920 1.1077 1.0770
irintensity: 0.2132 3.9430 0.6469 0.7306 0.3767 0.6763 1.1559 1.1963 1.9848 2.9003 1.2159 1.8524 1.7489 2.8192 1.1704 0.6369 1.3016 0.5021 3.2087 2.0779 5.8867 2.3442 5.9857 2.2112 0.4812 0.1890 0.4633 1.2148 2.6326 2.0247 15.0792 1.5145 0.1999 0.6394 2.8544 12.0573 31.1049 8.2268 0.0752 76.0816 2.3927 5.9751 1.1432 5.7221 3.0503 4.4127 9.4264 5.2347 4.1702 5.1934 8.8250 4.3862 21.6965 65.6446 3.8628 1.0527 24.4665 3.5649 3.8857 2.2596 2.7236 21.1373 104.8882 0.6215 19.8772 40.1206 78.4105 10.4834 9.4301 2.3055 4.9805 36.7459 11.4639 22.1497 47.5665 33.0153 0.4220 0.9438 1.5729 4.9165 39.5223 49.8386 26.8460 52.9356 1.2142 5.1856 14.3887 17.6682 53.6731 6.1712 38.1939 6.1940 3.1275 209.6820 106.1330 63.1004 267.2835 26.4729 22.9716 99.4146 47.4872 34.4883 117.9372 7.6394 10.7827 104.6305 34.0448 63.7809 907.2379 1.8767 34.4317 161.9896 145.8452 13.3936 18.7316 42.6683 1.9644 75.3901 11.4526 15.0331 14.1051 14.6620 1.4827 2.8609 17.9260 2.6914 11.7849 2.3744 5.2811 44.7054 25.3052 50.0188 61.4489 72.5837 18.7734 8.1631 825.4944 83.9049 34.7344 36.9881 48.1849 47.3936 5.9347 12.3876 79.2521 78.8379 19.1910 2.5377 2.3925 2.0787 3.5534 14.7860 47.3806 97.3527 33.9146 46.6184 13.7739 9.0100 13.7750 1.8323 13.4658 15.8402 6.7185 1.5397 141.2787
temp: 298.150 k
press: 1.00000 atm
elementType: 16 8 8 7 7 7 7 7 7 6 6 6 6 6 6 6 6 6 6 6 6 6 6 6 6 6 6 6 6 6 6 1 1 1 1 1 1 1 1 1 1 1 1 1 1 1 1 1 1 1 1 1 1 1 1 1 1
symmnumber: 1
zpe: 1166623.6 jmol-1
zpe.correction: 0.444343 hartree
zpe.thermalcorrener: 0.477819 hartree
zpe.thermalcorrenthalpy: 0.478763 hartree
zpe.thermalcorrgfe: 0.375320 hartree
zpe.sumelectzpe: -1728.475038 hartree
zpe.sumelectthermal: -1728.441563 hartree
zpe.sumelectthermalent: -1728.440618 hartree
zpe.sumelectthermalfe: -1728.544062 hartree
dipole: -1.2436 0.1143 -2.1396
dipole: 2.4774
quadrupole: -126.7621 -204.0496 -198.9026
quadrupole: -31.5980 -0.7613 8.4210
quadrupole: 49.8093 -27.4782 -22.3311 -31.5980 -0.7613 8.4210
hfenergy: -1728.9193816 hartree
pointgroup: C01 [X(C22H26N6O2S1)]
dipole: -0.5227828 0.0036395 0.8225996 debye
polarizability: 734.3667354|-22.8985458|402.8281188|19.0873243|11.7807884|176.3239999 unknown
InChI: InChI=1S/C22H26N6O2S/c1-5-9-28(10-6-2)19-7-8-20(21(13-19)27-31(4,29)30)25-26-22-17(14-23)11-16(3)12-18(22)15-24/h7-8,11-13,27H,5-6,9-10H2,1-4H3
charge 0 multiplicity 1
57 atoms
S  -0.940888 3.484924 -0.068388
O  -0.597387 3.666872 -1.645873
O  -2.489376 3.668517 0.4092
N  -4.407266 -0.77583 -0.158348
N  -0.339853 1.850639 0.615405
N  1.194123 -0.326844 0.236508
N  1.978568 -1.390234 0.11253
N  3.258444 -4.65809 -0.240125
N  2.721942 2.503758 0.576343
C  -5.102529 -2.03919 -0.493997
C  -5.260636 0.42606 0.014885
C  -3.029861 -0.698916 -0.034519
C  -5.431094 -2.91227 0.743509
C  -5.351325 1.308866 -1.255876
C  -2.395164 0.55416 0.229054
C  -2.201055 -1.883438 -0.155293
C  -0.996785 0.645644 0.32546
C  -6.188737 -4.19748 0.34936
C  -6.117092 2.61981 -0.97872
C  -0.171049 -0.537345 0.167261
C  -0.819906 -1.795826 -0.051119
C  0.197759 4.601328 0.96994
C  3.352695 -1.091229 0.153853
C  4.22836 -2.222796 0.027382
C  3.963501 0.204701 0.298464
C  6.232778 -0.789712 0.177656
C  5.633249 -2.066832 0.040221
C  5.380201 0.329415 0.305596
C  7.741608 -0.63754 0.187275
C  3.665181 -3.540058 -0.11745
C  3.20555 1.415588 0.442449
H  -4.503494 -2.619034 -1.219938
H  -6.043369 -1.77433 -1.011968
H  -4.886678 1.028274 0.863243
H  -6.272578 0.080941 0.298154
H  -4.492236 -3.168556 1.270117
H  -6.036969 -2.316504 1.453783
H  -4.331932 1.54795 -1.609737
H  -5.845222 0.733635 -2.063742
H  -2.974862 1.47023 0.348338
H  -2.657748 -2.862589 -0.317563
H  -7.143742 -3.962054 -0.157315
H  -5.588623 -4.823192 -0.33775
H  -6.42226 -4.807453 1.23968
H  -7.131384 2.425012 -0.580635
H  -5.569605 3.242447 -0.247464
H  -6.225991 3.212411 -1.904052
H  -0.188652 -2.685361 -0.140364
H  0.696776 1.801066 0.568116
H  1.221124 4.230396 0.805316
H  -0.138696 4.481707 2.007909
H  0.029476 5.614794 0.581033
H  6.26359 -2.95706 -0.060399
H  5.81468 1.329544 0.413921
H  8.042311 0.420463 0.268014
H  8.191156 -1.046309 -0.736601
H  8.19377 -1.18228 1.037061
