program: Gaussian 09
title: 000166217
version: EM64L-G09RevD.01
frameworkgroup: C1[X(C9H16)]
method: RPBEPBE
basis: SDD
operation: Freq
keyword: #p
keyword: freq=noraman
keyword: PBEPBE/SDD
title: #p freq=noraman PBEPBE/SDD
converged: YES YES NO NO
title: Mulliken charges:
elementType: C C C C C C C C C H H H H H H H H H H H H H H H H
charge: -0.173410 -0.422413 0.490481 -0.434227 -0.421484 -0.417092 -0.733889 -0.553613 -0.681289 0.201712 0.192937 0.203652 0.204389 0.204913 0.208308 0.207292 0.207483 0.214065 0.224905 0.214725 0.213026 0.199526 0.215674 0.224322 0.210006
chargesum: 0.00000
title: Mulliken charges with hydrogens summed into heavy atoms:
elementType: C C C C C C C C C
charge: 0.028302 -0.025824 0.490481 -0.024925 -0.005884 -0.209609 -0.080193 -0.141060 -0.031288
polarizability: 1.06337817e+02 7.13543157e+00 9.80531557e+01 -5.22535684e-01 2.40140056e+00 7.69820952e+01
1716.lowfreq: -20.4636 -16.7233 0.0004 0.0005 0.0005 20.3355 49.1615 92.7139 161.3793
frequency: 47.8275 92.6972 161.3780 193.7345 204.2967 241.9315 267.6112 296.5359 370.9574 382.6081 433.8715 524.3085 595.2702 631.2563 736.5343 780.3758 812.8083 824.4443 859.0759 877.8695 919.9838 962.2148 978.4007 989.1290 1025.0582 1052.4662 1070.5079 1094.5157 1106.4685 1123.8865 1163.1716 1180.6391 1182.6815 1248.7694 1253.1099 1297.9698 1302.7431 1321.2693 1329.9653 1334.6140 1346.9046 1366.5370 1384.6380 1387.6595 1456.4078 1461.6694 1466.9341 1473.4065 1475.3269 1476.3653 1483.3941 1487.7317 1679.6042 2943.6332 2955.3894 2969.1756 2974.0080 2976.9593 2978.8550 2983.0644 3001.7655 3025.4337 3029.0295 3043.9595 3068.6769 3072.4499 3075.5359 3079.8602 3081.9594
redmass: 2.3078 2.3637 1.9323 1.1412 1.3087 2.1188 2.0782 2.1275 2.4028 1.9282 3.2832 3.3259 2.5005 2.8316 2.1721 1.2613 1.2921 2.2176 2.1860 1.4572 2.1281 1.8853 1.6113 1.7219 1.8933 2.0095 1.6355 1.8023 1.5626 1.3451 1.9847 1.6485 1.6083 1.2142 1.1810 1.3507 1.3299 1.4129 1.7148 1.5019 1.4986 1.4792 1.3163 1.2066 1.0868 1.0699 1.0715 1.0891 1.0436 1.0546 1.0647 1.0705 7.0981 1.0648 1.0769 1.0591 1.0429 1.0537 1.0414 1.0673 1.0883 1.0989 1.0994 1.1033 1.0993 1.0992 1.0992 1.0923 1.0988
irintensity: 0.0437 0.0233 1.5842 0.0978 0.0370 0.1457 0.3531 1.1213 1.6326 0.6867 0.9313 1.3240 0.6956 6.7291 3.4322 2.7228 11.4781 1.5575 4.7216 9.7973 6.1198 8.3068 2.5340 8.5868 4.5392 4.1475 4.1325 0.4375 2.8179 3.2558 2.6226 3.1832 1.9645 0.3622 1.0104 2.1568 2.2426 0.2782 0.2317 1.6844 0.4833 4.8829 9.8925 15.8871 6.2161 3.6580 9.7365 13.6641 12.0477 0.7973 15.5668 12.5138 1.9384 47.3205 18.2708 28.2010 56.2287 19.3030 66.6162 27.7402 48.9309 11.9358 57.8505 73.0221 40.3391 56.4984 26.0131 34.7300 72.2935
temp: 298.150 k
press: 1.00000 atm
elementType: 6 6 6 6 6 6 6 6 6 1 1 1 1 1 1 1 1 1 1 1 1 1 1 1 1
symmnumber: 1
zpe: 595018.3 jmol-1
zpe.correction: 0.226631 hartree
zpe.thermalcorrener: 0.236642 hartree
zpe.thermalcorrenthalpy: 0.237586 hartree
zpe.thermalcorrgfe: 0.191655 hartree
zpe.sumelectzpe: -351.814658 hartree
zpe.sumelectthermal: -351.804647 hartree
zpe.sumelectthermalent: -351.803703 hartree
zpe.sumelectthermalfe: -351.849633 hartree
dipole: -0.0339 0.1497 0.1641
dipole: 0.2247
quadrupole: -56.1660 -56.5198 -58.5117
quadrupole: 0.4883 -0.5829 0.6137
quadrupole: 0.8998 0.5460 -1.4458 0.4883 -0.5829 0.6137
hfenergy: -352.0412885 hartree
pointgroup: C01 [X(C9H16)]
dipole: 0.018186 -0.0543016 0.0673614 debye
dipolederiv: 0.0119174 0.0016093 -0.0242776 0.0350381 0.0606744 0.0393362 -0.0661269 -0.0223333 0.1641251 0.0559287 -0.0474967 0.0064851 -0.0255739 0.0599616 0.0227606 0.004773 -0.0012432 0.0940078 0.1411679 -0.0151297 -0.0031243 -0.0212588 0.1268907 -0.1046117 0.0645773 -0.1457018 -0.1694382 0.0698793 -0.0155414 0.0329953 -0.028475 0.0491241 0.0426608 0.0164344 0.0624595 0.0994872 -0.0146289 0.0242028 -0.0492567 -0.0493109 0.0321302 0.0576489 -0.072226 0.0336303 0.1962051 0.0802665 0.060909 0.1022926 0.0059761 -0.0323366 -0.0981543 0.113453 -0.0426567 -0.213547 0.0519213 0.0238627 -0.0243782 0.0049517 -0.0171626 -0.0806361 -0.0093454 -0.0188059 -0.0013327 0.0220664 0.0202142 0.0021797 -0.0031878 0.1100554 0.0199262 0.0480803 0.0644872 0.1022751 -0.0315529 -0.0208503 0.0635611 -0.0108543 0.0840174 0.0061465 -0.0009285 -0.0164881 -0.0009816 -0.0382592 -0.0577878 0.1061182 -0.0786196 -0.0066713 0.0426248 0.1177156 0.0622416 -0.0855418 -0.0306663 0.1014867 -0.0468164 0.1230627 -0.1446179 0.1043015 -0.0294587 0.0655958 0.047414 0.0319322 -0.0151247 0.0435561 -0.0253905 -0.0013197 -0.1421088 0.0189756 -0.0860143 -0.1310935 0.0872379 0.0241478 0.016621 0.0603161 -0.0232856 -0.0859223 0.0702296 -0.0880736 -0.1262889 -0.208863 -0.0412393 -0.0820748 -0.0540824 0.0424664 -0.0100637 -0.1139453 -0.0075325 0.0424065 -0.0330051 -0.0789559 0.0647291 -0.0337048 0.0024988 0.0977172 0.1038095 0.142357 -0.0742822 -0.0186211 -0.0484842 -0.0172377 -0.0086945 -0.040909 -0.0990678 -0.077836 -0.1768338 -0.0541644 -0.050828 0.1068264 -0.0783654 0.0951664 -0.0615666 0.0848175 -0.0731126 0.101528 0.0978854 -0.1221801 -0.1003031 -0.1066862 -0.0548155 0.0856953 -0.0294677 -0.0906882 -0.0389299 0.0292948 -0.0055482 -0.0059076 0.1267012 -0.0486748 0.0619319 0.0723475 0.1089367 0.018441 -0.0400892 0.0429452 0.1230116 -0.0336427 0.0762932 -0.1523455 0.0586898 -0.0448138 0.096768 0.0295421 0.0027938 0.0268063 -0.0133571 0.1016897 -0.0744201 0.141576 -0.0321454 0.0967718 -0.0320939 0.013344 -0.0593365 0.0029975 -0.0800457 -0.0955698 -0.1369577 -0.0187812 -0.1146219 -0.0113886 -0.2496989 -0.0247106 -0.0108572 -0.0149839 0.0945055 -0.0036537 -0.0335292 0.0048816 0.0624307 0.0910447 -0.0524524 -0.0249532 -0.0027936 -0.0835442 -0.1262292 0.0152597 -0.0912771 -0.0023128 0.1014064 0.0702432 -0.0532095 0.0379722 -0.0762026 0.1263193 -0.0193075 0.1013503 -0.0225189 unknown
polarizability: 105.4623157|7.5271932|98.5946869|-0.3278601|-3.7272936|77.3160655 unknown
InChI: InChI=1S/C9H16/c1-3-9-7-5-4-6-8(9)2/h7-8H,3-6H2,1-2H3
charge 0 multiplicity 1
25 atoms
C  0.085039 -0.976085 0.357446
C  1.458328 -0.607243 0.98351
C  -0.601405 0.256097 -0.243491
C  2.304619 0.269475 0.032829
C  1.575331 1.599255 -0.269422
C  0.090477 1.398704 -0.518488
C  0.222003 -2.118929 -0.69004
C  -2.10175 0.167699 -0.504041
C  -2.954514 0.166771 0.793712
H  -0.563194 -1.36424 1.171879
H  2.00657 -1.533597 1.245618
H  1.290189 -0.050332 1.927587
H  2.482872 -0.276497 -0.914058
H  3.298473 0.471346 0.476128
H  2.03711 2.097977 -1.145598
H  1.708356 2.304441 0.5800
H  -0.455344 2.25738 -0.939394
H  -0.754801 -2.386335 -1.132664
H  0.892094 -1.821163 -1.516683
H  0.638435 -3.028795 -0.218031
H  -2.415152 1.020927 -1.135924
H  -2.335715 -0.751499 -1.079531
H  -4.032576 0.104451 0.555253
H  -2.78195 1.09159 1.373393
H  -2.706195 -0.691898 1.444109
