program: Gaussian 09
title: 000166247
version: EM64L-G09RevD.01
frameworkgroup: C1[X(C13H24O2)]
method: RPBEPBE
basis: SDD
operation: Freq
keyword: #pfreq=noraman
keyword: PBEPBE/SDD
title: #p freq=noraman PBEPBE/SDD
converged: YES YES NO NO
title: Mulliken charges:
elementType: O O C C C C C C C C C C C C C H H H H H H H H H H H H H H H H H H H H H H H H
charge: -0.304687 -0.267235 -0.095815 0.373388 -0.456221 -0.016979 -0.487045 -0.403291 -0.406076 -0.801366 -0.397637 -0.735554 -0.710932 0.304737 -0.770103 0.205831 0.196264 0.200371 0.181472 0.205054 0.255285 0.202829 0.191581 0.203654 0.205515 0.229458 0.270797 0.219349 0.200180 0.200030 0.218617 0.201994 0.213381 0.215556 0.210751 0.214580 0.243664 0.245695 0.242909
chargesum: 0.00000
title: Mulliken charges with hydrogens summed into heavy atoms:
elementType: O O C C C C C C C C C C C C C
charge: -0.304687 -0.267235 0.110016 0.373388 -0.059586 0.164494 -0.026707 -0.008881 0.003093 -0.081763 0.002573 -0.101562 -0.070045 0.304737 -0.037835
polarizability: 1.60884574e+02 -1.89492261e+00 1.52079463e+02 1.70858731e+00 3.12411923e+00 1.19489811e+02
1716.lowfreq: -0.0004 -0.0002 0.0006 6.8244 12.6297 15.2374 42.0725 50.9867 61.5829
frequency: 41.9385 50.9003 61.5057 78.0320 86.9539 109.5511 125.5616 157.4917 169.5214 189.0978 209.1635 254.7219 258.0180 281.0703 287.3820 306.6842 310.1318 327.4163 362.7269 381.4159 419.4122 447.8248 472.9468 487.9558 512.9186 555.6529 570.6290 640.7731 710.6628 764.3654 774.1837 804.4673 830.4391 866.1404 869.8639 893.5689 896.8649 932.7652 962.5350 969.5723 973.6771 988.4508 999.5914 1006.2199 1037.8833 1038.8020 1053.1336 1088.2180 1097.9320 1107.6278 1115.1737 1146.7522 1156.3968 1163.7752 1188.7318 1206.4401 1229.0725 1246.6026 1262.5155 1265.2947 1289.7470 1296.4834 1315.0962 1328.1590 1331.9134 1335.5385 1337.3615 1349.1647 1356.7494 1378.9823 1384.3498 1389.9988 1398.1603 1452.6493 1454.2672 1458.9888 1462.6263 1465.1756 1470.2474 1472.5187 1476.2957 1481.5837 1482.9693 1486.4697 1491.3980 1492.1182 1630.9111 2935.6024 2954.8390 2967.0862 2972.1562 2975.6579 2976.0254 2978.4766 2982.9747 2988.2038 3003.4732 3006.9176 3028.0021 3029.0242 3039.3094 3047.9244 3067.0664 3068.5312 3071.8829 3076.6303 3093.8921 3095.1779 3099.5153 3119.5891 3138.2496
redmass: 1.4466 2.1175 2.0732 2.3433 3.8684 2.7353 1.8156 1.4977 2.5601 1.7690 2.5711 1.1408 2.4241 3.7075 2.6822 2.2275 2.3460 2.1814 2.5559 3.3124 2.4941 2.5561 2.5681 2.8117 2.9512 1.9996 3.1223 3.2733 4.3816 1.2923 2.2565 1.9497 1.7142 2.6279 1.8048 3.3272 1.8740 2.1276 1.4706 1.7802 1.4212 1.7929 1.7816 1.6333 2.2132 1.6795 2.1797 2.0863 1.5493 1.5660 2.1147 1.6466 2.0436 1.9741 2.4403 3.3798 1.5295 1.5302 1.3084 1.2834 1.2375 1.6238 1.4191 1.3942 1.4362 1.4093 1.4201 1.4010 1.4788 1.2392 1.2358 1.2112 1.1904 1.0694 1.0502 1.0609 1.0855 1.0636 1.0705 1.0441 1.0688 1.0884 1.0662 1.0634 1.0562 1.0572 8.5688 1.0813 1.0804 1.0632 1.0630 1.0498 1.0532 1.0642 1.0637 1.0375 1.0370 1.0372 1.0973 1.0973 1.0984 1.0967 1.0985 1.0994 1.0991 1.0984 1.0964 1.0973 1.0971 1.0998 1.1014
irintensity: 1.5848 0.1710 0.1439 2.0634 0.8383 0.8309 0.6286 0.6285 0.3987 2.4364 3.2615 0.0605 1.3705 2.1535 1.7752 0.4026 0.3993 0.9145 1.1386 2.7346 0.8192 2.9197 0.7768 0.6088 3.0003 1.1792 3.5532 1.8758 8.1630 7.2013 3.9085 6.4862 0.1306 4.9336 1.1135 30.3364 26.7796 6.7505 1.0818 7.2045 5.3823 8.4103 88.7548 13.9440 1.4193 9.1075 1.1027 65.8975 51.0875 1.5688 11.9947 14.4293 15.7894 8.1205 8.0551 298.5531 24.3753 1.5221 3.9760 1.9797 0.3700 1.7224 0.0863 1.2649 4.2387 1.3813 1.0885 6.3016 2.9061 60.2624 35.2766 13.8568 15.5961 35.2446 12.4282 14.5312 8.4065 1.2110 11.6119 5.8398 1.5856 6.4497 4.8450 11.5371 16.0889 19.5679 191.0897 7.6594 4.7149 35.2419 1.1236 75.4096 29.4002 33.1401 35.4218 36.2302 4.2879 17.5634 0.7975 75.0613 59.5826 58.6355 16.8543 52.7026 68.0763 49.8428 9.5163 29.5458 38.4338 7.1144 12.8734
temp: 298.150 k
press: 1.00000 atm
elementType: 8 8 6 6 6 6 6 6 6 6 6 6 6 6 6 1 1 1 1 1 1 1 1 1 1 1 1 1 1 1 1 1 1 1 1 1 1 1 1
symmnumber: 1
zpe: 907913.3 jmol-1
zpe.correction: 0.345806 hartree
zpe.thermalcorrener: 0.363393 hartree
zpe.thermalcorrenthalpy: 0.364337 hartree
zpe.thermalcorrgfe: 0.300890 hartree
zpe.sumelectzpe: -659.016355 hartree
zpe.sumelectthermal: -658.998768 hartree
zpe.sumelectthermalent: -658.997824 hartree
zpe.sumelectthermalfe: -659.061271 hartree
dipole: -2.0367 0.2076 -1.0553
dipole: 2.3033
quadrupole: -103.3867 -89.1862 -92.9509
quadrupole: -2.5934 -5.1128 1.6774
quadrupole: -8.2121 5.9884 2.2237 -2.5934 -5.1128 1.6774
hfenergy: -659.362161 hartree
pointgroup: C01 [X(C13H24O2)]
dipole: 0.8077294 0.0981796 0.3988505 debye
polarizability: 160.9408778|1.8636532|151.6764528|0.9884159|-4.7413427|119.8365171 unknown
InChI: InChI=1S/C13H24O2/c1-5-10(2)12-8-6-7-9-13(12,4)15-11(3)14/h10,12H,5-9H2,1-4H3
charge 0 multiplicity 1
39 atoms
O  -1.25042 -0.8447 0.423543
O  -3.400075 -0.632587 -0.509727
C  0.842022 0.387118 0.23658
C  -0.646043 0.386953 -0.254638
C  1.480705 1.76616 -0.127735
C  1.774789 -0.774864 -0.270844
C  -1.414213 1.608329 0.326768
C  0.711815 2.978932 0.440632
C  -0.758756 2.961192 -0.023755
C  -0.79097 0.276288 -1.785825
C  3.077375 -0.830735 0.592841
C  1.152508 -2.195202 -0.289605
C  4.271569 -1.512982 -0.111868
C  -2.577442 -1.217032 0.236183
C  -2.88963 -2.435905 1.086286
H  0.787633 0.313059 1.345186
H  1.539185 1.854979 -1.23243
H  2.523915 1.793461 0.234677
H  2.075574 -0.519904 -1.311803
H  -1.435324 1.496016 1.429764
H  -2.458068 1.576603 -0.030473
H  1.207696 3.918929 0.129681
H  0.74544 2.948266 1.549362
H  -1.330554 3.778792 0.455364
H  -0.810308 3.139487 -1.116592
H  -0.334899 -0.651074 -2.168537
H  -1.852471 0.295582 -2.077333
H  -0.278979 1.125067 -2.271623
H  2.844757 -1.368756 1.535182
H  3.390143 0.18777 0.889717
H  0.776443 -2.468761 0.711963
H  1.917854 -2.935769 -0.588251
H  0.308641 -2.288458 -0.991712
H  5.160799 -1.534713 0.545125
H  4.547317 -0.967856 -1.034529
H  4.044048 -2.556895 -0.39462
H  -2.949579 -2.142316 2.149972
H  -2.089462 -3.189182 0.996057
H  -3.854837 -2.863392 0.777219
