program: Gaussian 09
title: 000166222
version: EM64L-G09RevD.01
frameworkgroup: C1[X(C15H24O)]
method: RPBEPBE
basis: SDD
operation: Freq
keyword: #pfreq=noraman
keyword: PBEPBE/SDD
title: #p freq=noraman PBEPBE/SDD
converged: YES YES NO NO
title: Mulliken charges:
elementType: O C C C C C C C C C C C C C C C H H H H H H H H H H H H H H H H H H H H H H H H
charge: -0.225027 0.348034 -0.279019 -0.499464 -0.451974 0.410587 -0.768637 -0.759470 -0.394892 -0.269391 -0.837552 0.206392 -0.788976 0.125690 -0.486893 -0.687430 0.199485 0.213301 0.208723 0.221510 0.211729 0.209037 0.240589 0.213920 0.212154 0.227020 0.213822 0.213302 0.259205 0.221278 0.227435 0.241320 0.208578 0.249294 0.243499 0.231030 0.226144 0.229753 0.229542 0.206348
chargesum: 0.00000
title: Mulliken charges with hydrogens summed into heavy atoms:
elementType: O C C C C C C C C C C C C C C C
charge: -0.225027 0.348034 -0.079534 -0.077439 -0.018734 0.410587 -0.105090 -0.106473 -0.181590 -0.010186 -0.147519 0.206392 -0.087605 0.125690 -0.029718 -0.021787
polarizability: 2.09745982e+02 1.33181007e+01 1.49746861e+02 1.45934876e+01 8.17538056e+00 1.44459120e+02
1716.lowfreq: -22.7063 -0.0007 -0.0005 0.0007 7.1069 8.3884 22.8710 42.1968 54.1146
frequency: 21.7167 41.7984 54.1128 66.9120 73.1419 99.0901 107.4833 163.2103 178.7326 183.7288 190.2536 211.7674 226.8222 253.0402 267.6373 272.3870 279.2632 295.3204 334.2996 341.1096 357.2363 397.7226 404.2673 437.8481 469.6557 488.3400 512.2702 575.0123 579.5471 614.2014 639.4721 727.9742 759.3545 790.7115 818.6274 832.5813 875.8745 900.6714 909.6733 914.3049 931.3707 939.9194 964.3937 986.1867 998.4539 1010.7308 1028.4987 1037.1119 1038.5093 1046.3340 1070.4572 1090.8071 1092.4043 1105.2616 1131.5225 1140.2605 1178.7021 1197.6642 1213.6357 1231.6288 1247.4564 1261.4698 1269.4854 1301.7733 1322.8017 1324.5101 1336.6486 1344.2936 1377.5233 1378.3102 1391.7652 1394.8405 1396.5377 1403.5145 1442.4498 1454.6666 1458.7207 1460.0830 1461.1248 1462.3242 1467.0935 1468.2167 1475.0878 1476.6679 1477.3281 1481.0700 1493.4207 1573.1257 1637.5638 1684.7237 2949.9468 2960.7720 2966.5465 2969.9196 2972.7805 2973.6544 2985.9229 2992.9783 2996.3718 3001.1647 3021.1308 3027.5642 3035.1061 3057.6634 3063.7756 3066.5740 3067.8431 3077.3960 3080.6306 3091.2789 3091.4763 3101.6659 3105.3794 3108.0058
redmass: 3.6034 2.9880 2.8322 2.8149 2.0450 1.1594 3.2362 1.6274 1.4107 1.5774 1.8881 1.1615 2.4999 1.2913 2.2708 2.6642 2.8082 1.7713 2.6676 2.9085 3.0811 2.6793 3.0303 3.3995 3.4368 3.5118 2.7237 2.1464 3.2817 3.6189 2.8979 2.2119 2.8382 1.4912 1.4101 1.9126 2.0895 2.6312 1.5609 3.1694 1.7662 1.5651 1.9691 1.4553 1.5928 1.5298 1.7328 1.4034 1.8281 1.6229 1.6979 2.2749 1.6790 3.0162 1.7494 1.6674 2.1702 2.2186 1.7380 2.0283 1.1864 1.9438 1.5071 1.5685 1.7914 1.7900 1.4657 1.6061 1.2794 1.3675 1.2392 1.2112 1.2092 1.3029 1.0987 1.0466 1.0719 1.0579 1.0599 1.0770 1.0394 1.0560 1.0590 1.0787 1.0528 1.0605 1.0565 7.9078 6.5150 6.6737 1.0645 1.0377 1.0371 1.0511 1.0594 1.0471 1.0790 1.0398 1.0367 1.0912 1.0986 1.1022 1.0957 1.0995 1.0984 1.0989 1.0961 1.0985 1.0986 1.0907 1.0996 1.0999 1.0923 1.0936
irintensity: 1.4919 0.0840 0.2645 0.4274 3.5536 0.0251 0.2295 0.5209 0.6623 0.5480 0.5761 0.0401 0.2218 0.3122 0.1688 5.2552 1.2513 0.5887 4.9689 5.1122 1.0423 0.3180 1.5206 0.4593 0.7604 1.3885 1.7270 1.2468 16.0808 4.1402 1.4452 7.1836 4.6549 17.9492 24.2662 5.0385 1.1681 0.5614 8.9582 7.9030 1.1386 2.6408 12.9735 1.3327 13.0238 7.2792 1.5891 1.4983 66.8851 11.1218 1.2880 7.0682 11.0233 9.5216 4.7388 1.7034 41.0644 4.5014 21.3825 64.1402 0.1911 6.2181 12.5706 7.3412 5.4983 31.6201 7.7937 3.4454 27.7007 2.5094 14.1279 24.9607 17.4788 35.4530 15.6777 12.7203 4.9542 4.6168 2.4943 11.2177 11.6353 8.6120 6.0427 17.0338 16.5727 4.9221 9.6178 161.2866 45.5356 0.8941 40.4868 33.3493 17.2462 41.8961 38.4816 27.3213 15.2505 28.6297 29.4051 39.3387 9.2927 46.7064 21.8991 0.7657 67.4627 47.2617 13.3706 20.5041 31.8516 39.3345 28.6575 31.9067 5.7059 28.9822
temp: 298.150 k
press: 1.00000 atm
elementType: 8 6 6 6 6 6 6 6 6 6 6 6 6 6 6 6 1 1 1 1 1 1 1 1 1 1 1 1 1 1 1 1 1 1 1 1 1 1 1 1
symmnumber: 1
zpe: 918679.2 jmol-1
zpe.correction: 0.349906 hartree
zpe.thermalcorrener: 0.368838 hartree
zpe.thermalcorrenthalpy: 0.369783 hartree
zpe.thermalcorrgfe: 0.302601 hartree
zpe.sumelectzpe: -659.937039 hartree
zpe.sumelectthermal: -659.918107 hartree
zpe.sumelectthermalent: -659.917163 hartree
zpe.sumelectthermalfe: -659.984344 hartree
dipole: -3.6910 -1.1291 -0.9278
dipole: 3.9698
quadrupole: -114.6164 -96.4257 -97.9855
quadrupole: -3.7499 -3.6807 0.5790
quadrupole: -11.6072 6.5835 5.0237 -3.7499 -3.6807 0.5790
hfenergy: -660.2869453 hartree
pointgroup: C01 [X(C15H24O1)]
dipole: 1.4638966 -0.0703421 -0.5398447 debye
polarizability: 210.6712934|-4.5388974|138.5141477|-17.7730533|1.7447774|154.7665217 unknown
InChI: InChI=1S/C15H24O/c1-6-14(16)12(3)10-13-11(2)8-7-9-15(13,4)5/h8,10,13H,6-7,9H2,1-5H3
charge 0 multiplicity 1
40 atoms
O  -3.970866 0.12727 0.760564
C  1.928092 1.163637 -0.157687
C  1.022707 0.124539 0.606814
C  2.265101 0.606777 -1.571276
C  3.004546 -0.750537 -1.520011
C  1.589401 -1.307506 0.528197
C  3.230146 1.383485 0.658869
C  1.195219 2.521296 -0.29324
C  2.454093 -1.680376 -0.456126
C  -0.401661 0.071875 0.080587
C  1.111849 -2.272347 1.596616
C  -1.572537 0.164731 0.789722
C  -1.671861 0.409527 2.283639
C  -2.897946 0.023843 0.090015
C  -2.95477 -0.248429 -1.423745
C  -4.393637 -0.373008 -1.955881
H  1.005754 0.426136 1.673511
H  2.878421 1.34931 -2.119012
H  1.326738 0.491499 -2.149638
H  4.086027 -0.587348 -1.322576
H  2.958471 -1.243385 -2.512022
H  3.00417 1.871991 1.625833
H  3.747032 0.431923 0.87347
H  3.928802 2.039806 0.106015
H  1.858106 3.272506 -0.763202
H  0.284082 2.435407 -0.913291
H  0.889984 2.909545 0.697119
H  2.826928 -2.715393 -0.466082
H  -0.46641 -0.118809 -0.999602
H  1.454154 -1.953177 2.601677
H  1.487058 -3.295405 1.419325
H  0.006248 -2.312556 1.635796
H  -0.687179 0.563664 2.752296
H  -2.307371 1.290401 2.484508
H  -2.170762 -0.44094 2.783834
H  -2.384725 -1.174225 -1.640151
H  -2.421029 0.567125 -1.952578
H  -4.930929 -1.193958 -1.451275
H  -4.966338 0.550785 -1.766648
H  -4.387508 -0.569679 -3.043266
