program: Gaussian 09
title: 000166175
version: EM64L-G09RevD.01
frameworkgroup: C1[X(C13H18O2)]
method: RPBEPBE
basis: SDD
operation: Freq
keyword: #pfreq=noraman
keyword: PBEPBE/SDD
title: #p freq=noraman PBEPBE/SDD
converged: YES YES NO NO
title: Mulliken charges:
elementType: O O C C C C C C C C C C C C C H H H H H H H H H H H H H H H H H H
charge: -0.287863 -0.268615 0.373649 -0.643311 0.476758 -0.730638 -0.739949 -0.389564 -0.388923 0.433827 -0.401385 -0.399908 0.308275 -0.807521 -0.763559 0.216542 0.269788 0.227580 0.220866 0.234145 0.260094 0.220554 0.238061 0.230770 0.237718 0.227793 0.228749 0.224540 0.235743 0.223728 0.244720 0.244641 0.242696
chargesum: 0.00000
title: Mulliken charges with hydrogens summed into heavy atoms:
elementType: O O C C C C C C C C C C C C C
charge: -0.287863 -0.268615 0.373649 -0.156981 0.476758 -0.048046 -0.021241 -0.158794 -0.151205 0.433827 -0.173592 -0.171159 0.308275 -0.123510 -0.031503
polarizability: 2.02654848e+02 4.54120442e-01 1.35572175e+02 8.28815390e+00 -9.64457127e+00 9.99523632e+01
1716.lowfreq: -40.0389 -11.9133 -3.1552 0.0004 0.0005 0.0007 6.6428 10.5797 30.3295
frequency: -39.8439 7.9253 29.4079 55.0882 67.6048 90.5368 108.2131 168.2669 172.8424 206.3729 244.4717 248.4014 265.7608 313.2735 318.3723 326.6142 374.1019 405.8467 409.3826 415.2908 460.0936 488.3546 545.8566 570.6915 625.2557 640.0396 700.4357 733.1575 760.2576 787.9415 825.6160 843.9313 854.9288 891.6463 907.8600 938.2759 951.0181 975.9764 981.2926 985.0483 996.7496 1014.6303 1017.1126 1038.9523 1047.1952 1106.2915 1123.6311 1138.6391 1192.2029 1212.8063 1216.3948 1223.3850 1239.5589 1292.3063 1312.9541 1319.9228 1375.4703 1378.4409 1379.8384 1394.2287 1396.7652 1407.1259 1451.8281 1454.3286 1458.2470 1466.8942 1471.5366 1472.3938 1473.0231 1482.8828 1495.1020 1508.5873 1582.2709 1624.8841 1636.0273 2973.4426 2992.9659 2996.2345 3001.5429 3006.0204 3054.4222 3073.2487 3083.1443 3086.4845 3093.3247 3094.6496 3103.2618 3110.5293 3113.7090 3116.6285 3133.1288 3140.4005 3140.4777
redmass: 1.0914 1.0289 3.7382 3.4188 3.9397 3.4090 4.8934 3.5305 4.0135 1.1449 2.4506 1.4115 2.0794 2.8779 3.5361 2.8040 2.8848 2.6998 2.8728 2.1589 2.8942 3.3688 3.3947 3.1107 3.7779 6.5989 4.1087 3.6955 3.3684 3.2376 1.9054 2.9510 1.2490 2.8582 2.4239 1.4088 1.3766 1.3848 1.9047 1.3970 1.7949 2.8880 1.3909 1.6698 1.5610 1.4238 1.8971 1.2670 1.1034 4.2437 3.8063 2.2661 3.0968 2.0322 1.3554 1.4506 3.3690 1.3035 1.3206 1.2290 1.2246 2.7113 1.0686 1.0477 1.0563 1.0484 1.0671 1.0914 1.0542 1.0793 1.0763 2.6340 5.9296 6.4481 8.5795 1.0386 1.0355 1.0388 1.0591 1.0364 1.0949 1.0998 1.0997 1.0993 1.0999 1.0974 1.0993 1.0870 1.0879 1.0989 1.0961 1.0981 1.1002
irintensity: 1.3728 0.6181 0.2318 0.7094 1.0221 1.5197 0.5178 4.8518 3.0229 0.1174 0.2623 3.7251 1.8182 3.6297 0.8412 2.8095 1.1382 1.8124 0.0386 0.5013 3.6057 16.5585 10.3504 5.9754 4.0997 0.0279 2.8910 11.4570 7.0083 6.7506 23.0594 15.9285 0.3590 36.1437 19.3404 1.5299 6.1244 0.3476 15.8352 0.1665 88.7381 2.4573 0.4477 9.1786 19.8718 1.2450 214.1476 19.6324 1.1751 183.6448 108.4837 1.6622 48.3204 1.9267 3.9784 6.9062 3.1532 35.5815 56.9493 22.1109 9.4912 2.0546 30.6609 18.4299 1.2843 6.8450 5.3597 11.4177 13.1349 16.8283 22.1629 32.6426 1.2395 0.9206 164.3038 40.4754 12.5470 25.2136 10.4157 4.0985 23.3090 4.4588 18.5802 16.7742 29.0593 13.0713 40.5923 7.3301 19.4577 8.0277 44.2565 1.7265 11.2699
temp: 298.150 k
press: 1.00000 atm
elementType: 8 8 6 6 6 6 6 6 6 6 6 6 6 6 6 1 1 1 1 1 1 1 1 1 1 1 1 1 1 1 1 1 1
symmnumber: 1
zpe: 726203.1 jmol-1
zpe.correction: 0.276596 hartree
zpe.thermalcorrener: 0.292475 hartree
zpe.thermalcorrenthalpy: 0.293419 hartree
zpe.thermalcorrgfe: 0.231127 hartree
zpe.sumelectzpe: -655.509446 hartree
zpe.sumelectthermal: -655.493567 hartree
zpe.sumelectthermalent: -655.492623 hartree
zpe.sumelectthermalfe: -655.554916 hartree
dipole: 0.7542 1.8686 0.4483
dipole: 2.0643
quadrupole: -78.1026 -92.3676 -90.6661
quadrupole: -5.1223 1.3344 -3.2662
quadrupole: 8.9428 -5.3221 -3.6207 -5.1223 1.3344 -3.2662
hfenergy: -655.7860424 hartree
pointgroup: C01 [X(C13H18O2)]
dipole: -0.2928724 0.7460129 -0.1314485 debye
polarizability: 202.3863309|-1.3571079|134.1429733|9.7441725|11.8791243|101.6500816 unknown
InChI: InChI=1S/C13H18O2/c1-10-5-7-12(8-6-10)9-13(3,4)15-11(2)14/h5-8H,9H2,1-4H3
charge 0 multiplicity 1
33 atoms
O  2.890153 0.641946 -0.000857
O  3.182407 -1.680248 0.220767
C  1.43454 0.571145 -0.469743
C  0.595845 -0.029632 0.705608
C  -0.905327 -0.072319 0.453275
C  1.112017 2.051839 -0.721405
C  1.351933 -0.251498 -1.768705
C  -1.748797 1.006333 0.825765
C  -1.5106 -1.20355 -0.15364
C  -3.743394 -0.165915 -0.024787
C  -3.140193 0.962109 0.58835
C  -2.9016 -1.247364 -0.391998
C  3.622452 -0.5078 0.290031
C  -5.245052 -0.229582 -0.247596
C  5.030982 -0.124129 0.7031
H  0.810976 0.583381 1.601648
H  0.972408 -1.049163 0.897075
H  1.780224 2.46144 -1.498447
H  1.249043 2.643403 0.200672
H  0.067827 2.159371 -1.059518
H  1.596265 -1.310428 -1.591304
H  2.050673 0.156266 -2.520921
H  0.328625 -0.185074 -2.177741
H  -1.311688 1.887731 1.31158
H  -0.885207 -2.059281 -0.43653
H  -3.767755 1.810764 0.888201
H  -3.341832 -2.135327 -0.862691
H  -5.498001 -0.843369 -1.13023
H  -5.75861 -0.681172 0.62374
H  -5.676079 0.776362 -0.396267
H  5.002158 0.526437 1.594475
H  5.522046 0.447855 -0.103154
H  5.611161 -1.031831 0.923647
