program: Gaussian 09
title: 000166256
version: EM64L-G09RevD.01
frameworkgroup: C1[X(C18H17ClN6O4)]
method: RPBEPBE
basis: SDD
operation: Freq
keyword: #p
keyword: freq=noraman
keyword: PBEPBE/SDD
title: #p freq=noraman PBEPBE/SDD
converged: NO YES NO NO
title: Mulliken charges:
elementType: Cl O O O O N N N N N N C C C C C C C C C C C C C C C C C C H H H H H H H H H H H H H H H H H
charge: -0.038825 -0.451048 -0.271643 -0.210503 -0.210675 -0.387467 -0.440838 -0.102520 -0.119249 0.017984 -0.054742 -0.362201 -0.109045 0.707411 -0.502487 0.347460 -0.404812 -0.702915 -0.059316 -0.260955 0.210467 0.048947 0.310897 -0.320009 0.406263 -0.497332 -0.352413 -0.772267 -0.164163 0.240413 0.226527 0.246354 0.348230 0.331753 0.250746 0.207991 0.230043 0.302484 0.394331 0.343254 0.265993 0.310049 0.292376 0.252289 0.246410 0.256753
chargesum: 0.00000
title: Mulliken charges with hydrogens summed into heavy atoms:
elementType: Cl O O O O N N N N N N C C C C C C C C C C C C C C C C C C
charge: -0.038825 -0.107794 -0.271643 -0.210503 -0.210675 -0.039236 -0.046506 -0.102520 -0.119249 0.017984 -0.054742 0.104739 0.137310 0.707411 -0.170734 0.347460 -0.404812 -0.014135 -0.059316 0.041529 0.210467 0.048947 0.310897 -0.054016 0.406263 -0.187283 -0.060037 -0.016815 -0.164163
polarizability: 8.06216796e+02 1.61826354e+01 3.17994025e+02 2.31749859e+00 5.99447818e-01 1.18716034e+02
1716.lowfreq: -46.8429 -2.3657 -0.0006 0.0006 0.0017 3.9253 6.2442 15.8293 26.9284
frequency: -46.8357 15.6691 26.9106 36.0521 42.0000 53.8945 60.8371 63.9172 75.0400 83.8169 89.2877 111.9945 128.2306 146.3108 148.1678 153.5110 165.1292 176.0906 200.6658 209.7566 229.4078 232.6357 250.3437 258.2637 282.6001 289.5278 318.5115 326.2596 347.5098 366.3026 393.0836 402.3771 405.0998 414.6340 434.7966 446.9101 481.0016 482.6568 484.7281 508.7069 519.8354 558.3285 566.5133 576.3360 586.5996 592.9980 633.9946 650.4550 678.2761 688.8030 697.4249 702.7776 728.9592 745.8381 755.6881 774.2149 807.7592 817.4023 866.4046 881.4327 882.8421 902.4089 909.7296 915.5201 926.6988 930.4622 934.5522 952.2096 976.5088 1002.4866 1014.7172 1037.3366 1039.8491 1077.6371 1078.0339 1118.4672 1123.4244 1143.1232 1154.9079 1178.0247 1194.8931 1198.7590 1210.3382 1223.8885 1229.9781 1257.7120 1261.8153 1275.4264 1290.8071 1308.6915 1324.6244 1357.0746 1364.0106 1374.0760 1378.6409 1386.2480 1391.4977 1396.4578 1413.9383 1429.5611 1443.1684 1459.4966 1459.8313 1465.2812 1469.1156 1473.7645 1475.8208 1505.4596 1534.6959 1535.7374 1555.6696 1603.6692 1621.1242 1622.4941 2156.3330 2940.2502 2980.4000 3009.6630 3026.6594 3050.1287 3078.0651 3094.7041 3101.3232 3144.4643 3169.0209 3175.8130 3176.3174 3191.4697 3192.8183 3382.3348 3446.8362 3548.3464
redmass: 1.1383 6.4645 6.9752 8.6812 5.9218 4.0158 11.9096 4.7357 5.8811 6.7642 3.6626 8.3730 7.3571 6.9965 5.5054 6.1194 11.5327 5.1982 5.7912 4.5424 7.0870 1.1877 3.1961 8.9319 7.1130 5.3909 5.2146 10.0762 1.1176 4.6263 9.6609 6.1211 4.1622 5.7229 4.3310 2.7989 4.9634 5.9746 3.9385 7.5170 4.0502 4.7808 5.2740 6.7913 3.0724 7.1776 6.0614 6.7819 5.6669 6.1246 6.0022 1.3473 10.6869 3.0262 5.1392 3.5652 5.7466 3.8639 1.5340 1.1201 6.0463 1.4945 1.6527 1.4215 5.9936 1.9320 3.1139 1.4730 2.2229 1.3508 2.1138 1.6904 1.3899 2.9028 2.3918 3.4164 1.6668 2.1234 4.4260 3.4148 4.1565 1.2431 3.8490 1.9804 1.8981 1.4352 1.8968 1.4263 1.7927 6.0142 2.0685 6.3378 1.7687 3.1095 1.2217 6.0962 1.2544 1.2368 4.1157 2.2287 1.1878 2.9875 1.0504 1.0711 3.0327 1.0598 1.0680 4.3381 3.9761 4.0034 7.4604 7.1745 4.9231 7.6248 12.6153 1.0664 1.0385 1.0376 1.0925 1.0895 1.0966 1.0963 1.0994 1.1011 1.0892 1.0921 1.0929 1.0968 1.0918 1.0786 1.0765 1.0660
irintensity: 2.0938 0.1285 0.4337 1.2917 2.2999 2.1338 0.2213 0.8729 2.2368 0.7508 7.1432 1.3706 4.3315 4.5645 2.4299 5.2209 7.0543 0.1088 9.1373 4.0062 3.3234 2.4211 3.2496 4.0176 2.8069 2.8655 2.5264 0.8601 231.2511 13.9795 2.5681 2.8059 0.0421 3.3591 25.3096 4.3742 29.7233 10.3091 0.2614 7.9513 12.9279 3.3945 7.1774 1.8976 0.0151 34.1446 13.7076 11.9713 2.9349 23.9122 30.2239 103.7759 23.2491 20.8416 0.9147 0.4812 1.9252 35.6182 31.8993 63.9913 155.7607 7.8772 10.8792 43.2152 1.4558 16.9994 17.2012 23.4742 45.2433 0.0356 38.0835 11.7595 123.3197 53.1441 22.9015 5.0509 66.6139 94.8138 11.4569 47.2602 1934.2483 170.8212 311.0150 117.7368 36.7130 59.2461 124.3982 66.4308 2.2007 771.9152 174.5035 83.2417 47.8651 158.0304 11.2935 64.1609 76.6988 9.6695 9.5482 330.5103 61.6831 22.8805 18.0539 19.7881 259.2846 15.7437 51.4527 20.4177 274.1852 379.7206 126.9401 253.3676 181.3308 555.8034 44.0427 68.5350 20.0570 0.6240 8.4221 6.5061 46.2143 6.4210 28.1112 17.0010 2.1333 5.3771 3.6623 1.4784 19.2664 79.3806 488.9891 11.5086
temp: 298.150 k
press: 1.00000 atm
elementType: 17 8 8 8 8 7 7 7 7 7 7 6 6 6 6 6 6 6 6 6 6 6 6 6 6 6 6 6 6 1 1 1 1 1 1 1 1 1 1 1 1 1 1 1 1 1
symmnumber: 1
zpe: 878240.4 jmol-1
zpe.correction: 0.334504 hartree
zpe.thermalcorrener: 0.361788 hartree
zpe.thermalcorrenthalpy: 0.362732 hartree
zpe.thermalcorrgfe: 0.274485 hartree
zpe.sumelectzpe: -1783.403439 hartree
zpe.sumelectthermal: -1783.376155 hartree
zpe.sumelectthermalent: -1783.375210 hartree
zpe.sumelectthermalfe: -1783.463458 hartree
dipole: 10.0957 -0.5966 0.7171
dipole: 10.1387
quadrupole: -194.8351 -183.4203 -172.2753
quadrupole: 8.8006 6.3836 -1.8868
quadrupole: -11.3249 0.0899 11.2349 8.8006 6.3836 -1.8868
hfenergy: -1783.7379427 hartree
pointgroup: C01 [X(C18H17Cl1N6O4)]
dipole: 3.9542126 0.1811701 -0.492341 debye
polarizability: 806.5795816|5.273612|247.4714236|-7.9898875|-95.037684|188.8758503 unknown
InChI: InChI=1S/C18H17ClN6O4/c1-10(26)9-21-16-7-17(22-11(2)27)18(6-14(16)19)24-23-15-4-3-13(25(28)29)5-12(15)8-20/h3-7,10,21-22,26H,9H2,1-2H3
charge 0 multiplicity 1
46 atoms
Cl 3.190733 2.705459 -2.347153
O  7.364824 1.130838 -1.64597
O  2.917196 -2.915499 1.781502
O  -7.957909 0.762128 -0.871825
O  -7.631775 -1.078372 0.442992
N  4.800533 0.649332 -0.809742
N  0.976368 -1.839533 1.005621
N  -0.730176 -0.126175 -0.236042
N  -1.56993 0.706322 -0.844342
N  -7.194399 -0.087133 -0.264277
N  -2.08508 -2.492052 1.442853
C  5.838185 -0.205772 -0.226666
C  7.194802 0.533698 -0.299718
C  3.453342 0.450988 -0.676186
C  2.926287 -0.620077 0.103107
C  1.537052 -0.801925 0.247014
C  2.516993 1.340006 -1.329753
C  8.373844 -0.367702 0.085006
C  0.620278 0.110787 -0.415649
C  1.153386 1.182382 -1.208803
C  1.652987 -2.834674 1.734564
C  -2.930388 0.413078 -0.630093
C  -3.47906 -0.676363 0.148972
C  -3.838746 1.31053 -1.268381
C  -5.734928 0.086121 -0.390312
C  -4.881854 -0.826103 0.259116
C  -5.225675 1.161646 -1.159103
C  0.738939 -3.808217 2.461577
C  -2.660116 -1.637237 0.83317
H  5.600966 -0.432732 0.829718
H  5.898411 -1.176157 -0.767149
H  7.154626 1.420175 0.357286
H  5.144483 1.370976 -1.457258
H  3.587308 -1.329356 0.600953
H  9.318386 0.199346 0.034026
H  8.450148 -1.23932 -0.594064
H  8.2585 -0.754173 1.113856
H  0.445212 1.853478 -1.701864
H  -0.055502 -1.866046 1.025802
H  7.655598 0.426876 -2.281545
H  -3.401642 2.126156 -1.851105
H  -5.316015 -1.642635 0.842658
H  -5.921794 1.848376 -1.646815
H  0.1233 -3.286005 3.215007
H  1.360566 -4.567796 2.95595
H  0.032835 -4.293947 1.766767
