program: Gaussian 09
title: 000166080
version: EM64L-G09RevD.01
frameworkgroup: C1[X(C4H12N2O)]
method: RPBEPBE
basis: SDD
operation: Freq
keyword: #p
keyword: freq=noraman
keyword: PBEPBE/SDD
title: #p freq=noraman PBEPBE/SDD
converged: NO YES NO NO
title: Mulliken charges:
elementType: O N N C C C C H H H H H H H H H H H H
charge: -0.287249 -0.544193 -0.475580 -0.357918 -0.379724 -0.404704 -0.234611 0.185508 0.185584 0.206407 0.206309 0.208026 0.207994 0.190511 0.190656 0.260726 0.260733 0.290790 0.290735
chargesum: 0.00000
title: Mulliken charges with hydrogens summed into heavy atoms:
elementType: O N N C C C C
charge: -0.287249 -0.022734 0.105944 0.013174 0.032992 0.011316 0.146556
polarizability: 8.85098495e+01 -6.88606610e-01 5.29054524e+01 -1.19871719e-02 1.85447781e-03 5.47087935e+01
1716.lowfreq: -2.4977 0.0009 0.0009 0.0009 10.6760 33.5653 57.3772 76.6598 99.1938
frequency: 56.8072 76.1218 99.1936 114.4550 139.1786 183.2088 253.7091 264.2531 296.3824 424.9866 494.9363 615.9127 740.1228 787.0204 797.2931 892.8168 911.0586 1006.9402 1012.3697 1044.9254 1075.2816 1097.8218 1131.2925 1145.6429 1206.7597 1222.4000 1248.8001 1268.1594 1286.9114 1322.1858 1335.2091 1355.1508 1367.0782 1459.5864 1470.0996 1480.2156 1493.1225 1602.1852 1643.8258 2957.2067 2965.1989 2983.7302 2991.0555 3002.5994 3016.0798 3043.2697 3061.1227 3315.2808 3447.5053 3454.8013 3572.9653
redmass: 3.5747 2.1090 3.9843 2.2787 1.8360 1.2862 3.4903 1.0743 5.3282 2.8735 3.1358 1.5551 1.0736 1.1229 5.0658 1.1822 3.7089 4.3643 1.1043 3.9949 2.6301 3.3254 2.0134 1.2477 1.1465 1.4418 1.2799 1.1823 1.1194 1.3099 1.1706 1.3519 1.4538 1.0752 1.0810 1.0906 1.0869 1.0695 1.0882 1.0584 1.0566 1.0601 1.0586 1.0998 1.1061 1.1059 1.1058 1.0412 1.0445 1.0990 1.0972
irintensity: 0.1350 3.7301 0.9328 1.3785 5.7791 69.6961 6.8946 61.0240 3.5117 28.8415 1.7288 328.8612 7.4900 0.0492 18.3039 0.0095 55.1777 24.8070 0.1455 8.1425 5.9947 22.8528 44.5852 0.8002 0.6824 0.0008 8.0988 1.3855 0.0067 0.2462 0.2895 6.5218 20.2145 0.8276 0.2446 6.7859 11.3942 12.1019 32.3169 6.2776 55.5699 19.4440 90.7316 7.4493 19.3195 5.7013 141.5938 5.8871 1.5268 0.1020 0.0762
temp: 298.150 k
press: 1.00000 atm
elementType: 8 7 7 6 6 6 6 1 1 1 1 1 1 1 1 1 1 1 1
symmnumber: 1
zpe: 438038.0 jmol-1
zpe.correction: 0.166840 hartree
zpe.thermalcorrener: 0.176704 hartree
zpe.thermalcorrenthalpy: 0.177649 hartree
zpe.thermalcorrgfe: 0.131601 hartree
zpe.sumelectzpe: -343.663694 hartree
zpe.sumelectthermal: -343.653830 hartree
zpe.sumelectthermalent: -343.652885 hartree
zpe.sumelectthermalfe: -343.698933 hartree
dipole: -1.2384 -1.0521 0.0003
dipole: 1.6249
quadrupole: -44.2243 -46.8202 -40.5956
quadrupole: -7.6445 -0.0203 0.0087
quadrupole: -0.3443 -2.9401 3.2844 -7.6445 -0.0203 0.0087
hfenergy: -343.8305339 hartree
pointgroup: C01 [X(C4H12N2O1)]
dipole: 0.495258 0.404255 -0.0020687 debye
dipolederiv: -0.5266836 0.1146566 -0.0006585 0.0040294 -0.3358445 -0.0000664 0.0003545 -0.0000319 -0.3601962 -1.1142127 -0.0961814 0.0003384 -0.1722276 -0.4332858 0.0022162 0.0010234 0.0022247 -0.1751988 -0.1757477 -0.0566806 0.0004364 0.0088894 -0.3029816 0.001021 0.0002443 0.0007961 -0.040095 -0.1835644 -0.0099814 -0.0000873 -0.2001548 0.0424535 0.0012003 0.0013785 0.0015014 0.1951441 -0.2148275 -0.00096 -0.0002393 0.0142798 0.0556665 0.0004067 -0.0002403 0.0003537 0.1555181 0.6703588 -0.0303365 0.0004942 -0.0102482 0.3507937 -0.0012867 0.000383 -0.0012543 0.2155837 0.668627 -0.1123859 0.0008979 -0.2045237 0.3300246 -0.0001164 0.0005901 -0.000048 0.4144035 0.0372251 0.0039761 -0.0012741 0.0112625 -0.0492884 -0.1168297 0.0147168 -0.1480401 -0.0973364 0.0370564 0.0040739 0.0011767 0.0110768 -0.0451781 0.1159972 -0.0149348 0.1471746 -0.1013781 0.0692097 -0.0037775 -0.0122911 -0.0034545 -0.0293465 -0.1086335 0.0017433 -0.1300445 -0.0727449 0.0688144 -0.0041719 0.0126439 -0.0038764 -0.0268588 0.1082444 -0.001292 0.1296778 -0.0755684 0.0079708 0.0231303 -0.01597 -0.0074629 -0.030279 0.1120647 -0.0151284 0.1509131 -0.0856702 0.0080154 0.0236106 0.0156945 -0.0070315 -0.0347856 -0.1129 0.0153573 -0.1517335 -0.0811346 -0.0109265 0.0171629 0.0130778 0.0587077 -0.0566488 0.1026745 -0.0117804 0.1429088 -0.114278 -0.0107687 0.0166511 -0.0136069 0.0583977 -0.0580511 -0.1028964 0.0110523 -0.1431484 -0.1123467 0.3075572 0.0354534 0.0900913 0.1624232 0.1102947 0.1372261 0.0346688 0.096416 0.0725676 0.3077188 0.0339991 -0.0904348 0.1619805 0.1061978 -0.1376454 -0.0372934 -0.0969878 0.0765769 0.0269491 0.0212578 0.0776092 0.0594203 0.2027784 -0.145352 0.0472507 -0.0992936 0.0942561 0.0272283 0.0205033 -0.0778983 0.0585122 0.204339 0.1446753 -0.0480935 0.0986158 0.0918974 unknown
polarizability: 88.4689465|-1.3884631|52.9463711|0.0334006|0.0077726|54.7087777 unknown
InChI: InChI=1S/C4H12N2O/c5-3-1-2-4-7-6/h1-6H2
charge 0 multiplicity 1
19 atoms
O  2.471292 -0.536913 0.001581
N  -3.785511 0.319111 -0.004225
N  3.742021 0.263479 0.00066
C  -1.22034 0.41623 -0.003482
C  0.062603 -0.448547 0.003052
C  -2.516828 -0.438948 0.003146
C  1.333738 0.40789 -0.000722
H  -1.227234 1.087526 0.880837
H  -1.227379 1.073692 -0.898128
H  0.074257 -1.11302 -0.882865
H  0.07202 -1.102951 0.896457
H  -2.515562 -1.096202 0.894494
H  -2.514375 -1.11142 -0.876769
H  1.38828 1.05202 -0.901677
H  1.389949 1.058195 0.895598
H  -3.932041 0.871087 -0.855954
H  -3.932972 0.886115 0.837412
H  4.245905 -0.070793 -0.840703
H  4.243777 -0.064753 0.845688
