program: Gaussian 09
title: 000166145
version: EM64L-G09RevD.01
frameworkgroup: C1[X(C20H24N2)]
method: RPBEPBE
basis: SDD
operation: Freq
keyword: #pfreq=noraman
keyword: PBEPBE/SDD
title: #p freq=noraman PBEPBE/SDD
converged: YES YES NO NO
title: Mulliken charges:
elementType: N N C C C C C C C C C C C C C C C C C C C C H H H H H H H H H H H H H H H H H H H H H H H H
charge: -0.139969 -0.073773 -0.375797 -0.363498 -0.313962 -0.378862 -0.389460 0.448348 0.464175 -0.409560 -0.434694 -0.453223 -0.371863 -0.347156 -0.056371 -0.226511 -0.225001 -0.246657 -0.241856 -0.245180 -0.245117 -0.581081 0.232784 0.193203 0.189487 0.231036 0.194956 0.222496 0.183252 0.183304 0.204612 0.210692 0.186639 0.225964 0.228270 0.260293 0.243606 0.235739 0.222460 0.223362 0.223085 0.223576 0.226610 0.226675 0.216428 0.218540
chargesum: 0.00000
title: Mulliken charges with hydrogens summed into heavy atoms:
elementType: N N C C C C C C C C C C C C C C C C C C C C
charge: -0.139969 -0.073773 0.050190 0.057025 -0.119006 0.026887 -0.001544 0.448348 0.464175 -0.012229 -0.208730 -0.224953 -0.111570 -0.103550 0.179368 -0.004052 -0.001639 -0.023572 -0.018281 -0.018570 -0.018442 -0.146113
polarizability: 2.40867414e+02 1.75909221e+01 2.33858575e+02 1.46976223e+01 5.34223386e+00 1.93209010e+02
1716.lowfreq: -6.9901 -0.0007 -0.0005 -0.0004 2.9568 5.1022 6.8936 31.6768 45.4638
frequency: 4.8921 31.5578 45.4602 50.4977 57.8038 73.8382 78.9622 92.6183 121.3288 175.7070 201.0623 224.6116 229.8862 257.7026 259.7609 269.5895 319.0304 340.9140 381.7150 391.2942 402.0588 407.9059 419.6653 468.5849 480.8109 486.5697 537.8187 604.9744 606.2280 617.7893 618.1598 642.4663 650.5825 699.5525 710.8597 754.0519 758.9093 779.2362 817.4930 832.2471 846.1060 849.1882 851.7037 861.7014 912.8890 916.6617 926.6504 935.8725 949.8171 973.7876 984.6597 989.2446 991.1099 991.8776 993.0763 1000.1613 1004.2713 1016.8730 1022.5794 1025.0818 1028.3150 1061.0766 1073.0461 1081.2015 1096.1808 1116.3864 1134.4545 1137.3197 1146.3515 1168.4473 1169.9315 1170.7421 1178.7607 1183.4877 1188.8823 1194.3323 1205.1410 1230.1031 1261.9660 1272.0541 1273.4893 1285.6633 1297.1353 1308.4049 1326.8340 1330.5896 1334.5435 1344.7283 1362.7308 1379.8607 1383.7337 1384.8918 1393.4949 1427.2640 1439.1904 1440.8362 1450.2913 1458.5547 1460.2232 1468.5918 1475.6036 1476.6210 1480.3283 1592.6487 1594.5952 1608.2084 1612.8373 1658.7844 2824.6670 2845.1772 2847.0630 2860.6033 2870.5422 2880.3153 2982.1869 3024.8468 3042.7139 3062.5769 3066.9895 3084.4753 3103.4266 3112.1745 3114.0135 3121.5380 3123.9104 3134.6207 3137.0225 3145.0912 3149.6862 3160.7912 3162.7106 3195.0636
redmass: 3.6732 4.1461 4.4326 3.7861 3.5341 3.7738 3.1503 3.3299 2.6420 3.3482 3.8780 4.5756 3.5917 2.3469 3.4965 3.4826 2.9051 2.5398 3.2692 2.4338 2.7908 2.8493 2.0735 3.2585 3.0613 2.9313 2.7011 5.0979 2.7641 5.0324 5.3617 2.8944 2.0815 1.8135 1.7214 1.7734 2.4528 3.2902 3.9665 2.8897 3.1630 1.3593 1.4858 1.2634 1.4532 1.5492 2.0118 1.5049 1.3528 1.3976 1.4010 4.3088 3.9204 2.0173 1.3858 1.8067 1.6740 1.3990 2.1814 2.0843 2.2336 1.7668 1.5939 1.7098 2.0382 2.3485 2.7764 2.6566 2.7788 2.4452 1.0872 1.0696 1.1645 1.2962 1.9406 1.4924 1.3937 1.3064 1.5621 1.3160 1.4114 1.3540 1.3908 1.2723 1.3375 1.3137 1.2861 1.2789 1.4483 2.8169 6.2287 1.4658 2.0994 1.2149 2.1169 2.1433 1.0898 1.0808 1.0818 1.1025 1.1231 2.2223 2.2847 6.0571 6.2063 6.1646 6.1615 4.7580 1.0810 1.0697 1.0711 1.0693 1.0710 1.0691 1.0873 1.0889 1.0889 1.0874 1.0886 1.0600 1.0938 1.0869 1.0867 1.0860 1.0864 1.0911 1.0918 1.0956 1.0951 1.1014 1.1011 1.1142
irintensity: 0.0984 0.0794 0.0756 0.0144 0.0371 0.3888 0.0092 0.0351 1.0289 2.3547 1.4244 0.2883 0.1040 0.9167 0.6863 0.6217 2.1050 8.2785 0.6415 2.7643 0.1733 0.2030 0.1518 1.9015 0.2951 1.7937 20.7583 8.4704 0.8928 1.1205 4.6777 15.7080 2.1263 29.1015 79.2253 40.7046 32.5321 6.9405 23.5252 8.4259 0.7805 0.1461 0.5751 0.1120 3.7328 1.8063 14.6652 9.6771 80.9160 0.0735 0.6083 0.6287 0.6061 0.1312 3.3269 56.2109 31.0473 19.3078 3.3848 10.5273 3.1968 0.1390 0.5896 22.4296 4.9645 17.3380 53.6931 36.2601 21.3420 1.7053 0.1264 0.4833 2.2731 4.4683 5.7892 1.0525 0.6399 2.2055 6.6840 4.2096 10.3492 16.8617 31.7969 3.5419 19.2742 7.9214 7.4556 2.0910 0.9782 1.0832 0.1634 0.5150 5.2747 18.0415 3.7880 20.3308 1.5726 2.1961 1.8017 20.8626 0.6555 26.7817 8.6184 0.1682 2.2237 12.4053 2.0639 8.0904 47.6524 37.7298 62.5261 71.2768 16.3438 232.8974 26.3872 47.8801 26.5391 34.5452 15.6080 13.4681 9.5009 7.6291 7.5161 0.2229 0.2970 13.2478 30.8075 19.4160 41.7698 33.6674 20.0112 28.7813
temp: 298.150 k
press: 1.00000 atm
elementType: 7 7 6 6 6 6 6 6 6 6 6 6 6 6 6 6 6 6 6 6 6 6 1 1 1 1 1 1 1 1 1 1 1 1 1 1 1 1 1 1 1 1 1 1 1 1
symmnumber: 1
zpe: 1023695.8 jmol-1
zpe.correction: 0.389905 hartree
zpe.thermalcorrener: 0.409926 hartree
zpe.thermalcorrenthalpy: 0.410871 hartree
zpe.thermalcorrgfe: 0.338041 hartree
zpe.sumelectzpe: -884.365710 hartree
zpe.sumelectthermal: -884.345689 hartree
zpe.sumelectthermalent: -884.344745 hartree
zpe.sumelectthermalfe: -884.417575 hartree
dipole: -0.0191 -0.3102 0.0750
dipole: 0.3197
quadrupole: -131.5001 -125.6640 -123.3019
quadrupole: 1.8064 5.0303 0.0843
quadrupole: -4.6781 1.1580 3.5201 1.8064 5.0303 0.0843
hfenergy: -884.7556156 hartree
pointgroup: C01 [X(C20H24N2)]
dipole: 0.0082722 -0.1200602 -0.0365566 debye
polarizability: 239.6347914|-18.3614087|234.5350962|15.3011581|-3.5825585|193.7651114 unknown
InChI: InChI=1S/C20H24N2/c1-2-13-21-14-16-22(17-15-21)20(18-9-5-3-6-10-18)19-11-7-4-8-12-19/h2-12,20H,1,13-17H2
charge 0 multiplicity 1
46 atoms
N  -0.536074 -0.196799 0.094897
N  -3.412904 -0.665614 0.0386
C  -1.504355 0.808512 0.618156
C  -1.109868 -1.558903 0.274727
C  0.812485 -0.050198 0.723433
C  -2.848231 0.696454 -0.116045
C  -2.452286 -1.676295 -0.463226
C  1.424558 1.329663 0.424496
C  1.778515 -1.150188 0.251919
C  -4.759677 -0.805673 -0.567464
C  2.242645 1.957841 1.394117
C  2.508781 -1.907944 1.19813
C  1.240443 1.9644 -0.829811
C  1.984621 -1.39859 -1.129204
C  -5.805075 -0.001547 0.178491
C  2.874166 3.191723 1.118454
C  3.433393 -2.89264 0.778465
C  1.865451 3.199463 -1.107015
C  2.900578 -2.384971 -1.551832
C  2.688699 3.817093 -0.13589
C  3.632571 -3.134404 -0.599369
C  -6.718339 0.816102 -0.401702
H  -1.090928 1.820635 0.472768
H  -1.678085 0.659809 1.713484
H  -1.273569 -1.785835 1.358292
H  -0.405779 -2.305583 -0.128257
H  0.730378 -0.143546 1.838747
H  -3.561998 1.428175 0.303279
H  -2.692629 0.95126 -1.196388
H  -2.265255 -1.559676 -1.561782
H  -2.874048 -2.684978 -0.292948
H  -5.029796 -1.880688 -0.509414
H  -4.772441 -0.5255 -1.652317
H  2.390829 1.476061 2.369048
H  2.351486 -1.729535 2.269354
H  0.588398 1.487442 -1.570162
H  1.414363 -0.821768 -1.865238
H  -5.79628 -0.136503 1.270227
H  3.505411 3.664428 1.879548
H  3.991695 -3.470746 1.52364
H  1.711594 3.681351 -2.079573
H  3.04835 -2.568388 -2.622356
H  3.175592 4.774708 -0.352485
H  4.347232 -3.89739 -0.928099
H  -7.473828 1.34498 0.190121
H  -6.738287 0.9767 -1.487314
