program: Gaussian 09
title: 000166204
version: EM64L-G09RevD.01
frameworkgroup: C1[X(C23H26N2O5S)]
method: RPBEPBE
basis: SDD
operation: Freq
keyword: #p
keyword: freq=noraman
keyword: PBEPBE/SDD
title: #p freq=noraman PBEPBE/SDD
converged: YES YES NO NO
title: Mulliken charges:
elementType: S O O O O O N N C C C C C C C C C C C C C C C C C C C C C C C H H H H H H H H H H H H H H H H H H H H H H H H H H
charge: 0.972541 -0.314904 -0.298263 -0.556579 -0.490372 -0.513311 -0.447260 -0.667283 0.276855 -0.030874 -0.485808 -0.005900 -0.477280 -0.429616 -0.743485 -0.776811 -0.752432 0.298203 0.086268 -0.376498 0.213325 -0.408825 0.385619 -0.147518 -0.170298 0.294412 0.280178 -0.388160 -0.384546 -0.228665 -0.229241 0.206643 0.200348 0.193808 0.217246 0.224952 0.219029 0.209530 0.190926 0.209876 0.230999 0.214572 0.220319 0.217891 0.238304 0.382255 0.216906 0.209604 0.215738 0.301218 0.356924 0.391479 0.292396 0.294194 0.237774 0.238411 0.385185
chargesum: 0.00000
title: Mulliken charges with hydrogens summed into heavy atoms:
elementType: S O O O O O N N C C C C C C C C C C C C C C C C C C C C C C C
charge: 0.972541 -0.314904 -0.298263 -0.171394 -0.490372 -0.513311 -0.065005 0.081120 0.276855 0.175769 -0.091652 0.211347 -0.033298 -0.029160 -0.088039 -0.100296 -0.110184 0.298203 0.086268 -0.075280 0.213325 -0.408825 0.385619 -0.147518 -0.170298 0.294412 0.280178 -0.095764 -0.090352 0.009109 0.009170
polarizability: 4.83108687e+02 6.50914213e+01 4.23238696e+02 5.45467906e+00 -4.69115408e-01 1.80718325e+02
1716.lowfreq: -2.1765 -0.0012 -0.0012 0.0013 5.2023 7.3269 20.8635 24.1774 35.1263
frequency: 20.5511 23.9021 35.0820 41.5120 43.6362 76.4985 92.1278 101.1409 113.2381 129.3146 145.2582 148.9385 164.2402 170.6395 172.7050 178.9596 196.0191 210.0877 221.2597 225.3644 229.4160 233.4671 262.3734 268.0218 282.1166 286.3742 295.0383 318.5103 320.5829 328.4575 359.1327 375.3298 381.4598 393.0549 400.5580 405.0932 418.2956 425.8510 429.7814 446.1278 450.5253 456.2676 475.3380 492.1477 512.5643 519.4854 520.8373 547.8973 563.8887 603.7914 632.7344 641.3190 653.7626 670.4548 703.6100 707.0086 735.5328 738.4454 770.1293 789.4517 799.6581 808.0009 821.5414 837.1311 842.4376 858.7470 861.5077 871.6874 877.7060 883.5151 908.0407 911.4774 934.3528 937.1554 938.5445 948.9269 957.4294 968.9094 981.8630 997.4137 1008.5058 1010.5023 1014.1823 1019.4030 1038.6930 1044.9245 1051.8520 1058.6900 1085.4077 1088.7322 1108.0212 1139.0985 1145.8162 1147.2149 1169.4459 1178.2950 1180.1321 1212.6278 1220.1173 1241.4904 1248.3601 1267.8698 1281.6256 1286.2814 1297.3235 1305.9909 1310.6028 1316.1387 1330.9116 1343.4145 1349.9516 1352.0062 1359.5677 1373.3891 1384.5474 1386.2131 1388.5939 1404.7958 1408.1211 1423.1657 1451.0668 1452.3436 1458.4907 1461.1381 1466.3339 1473.4786 1474.7528 1475.3502 1476.9263 1479.1062 1491.0659 1493.3589 1508.0417 1534.4713 1563.2949 1580.5319 1598.3039 1609.0245 1639.3976 2941.3793 2946.3029 2954.1688 2966.1281 2968.3515 2971.6011 2982.1143 2987.3668 3013.6199 3027.5149 3043.1420 3061.2303 3064.1000 3066.8217 3067.5582 3076.3422 3081.5802 3131.0875 3135.9717 3153.0456 3163.8376 3166.7098 3174.1490 3219.9352 3474.0801 3481.9796
redmass: 3.6298 6.7560 5.2651 4.6960 6.4696 5.0512 6.3742 4.3469 5.6507 4.7698 2.7006 5.8936 2.3160 5.2238 2.1665 1.8353 4.3082 4.0318 1.8955 1.5509 2.1104 1.2405 2.2759 3.3205 3.6737 3.2856 2.9605 7.0876 6.1206 3.6354 5.2823 3.2082 4.6125 6.6856 4.9334 3.9518 3.2420 3.2325 4.2718 4.8014 4.8627 5.6558 4.8248 3.6729 4.6261 3.4161 4.5870 8.2769 4.6948 3.3644 4.6165 5.8471 5.9622 2.2811 4.4861 1.7303 2.5728 2.7168 5.1397 3.4492 2.2525 1.9062 11.3015 1.8059 1.4813 1.3290 1.2783 6.5723 2.0837 5.4173 1.8704 1.7866 1.6698 2.0372 1.9163 6.6537 1.4170 3.2155 2.5235 1.3866 1.4518 1.4835 1.3622 2.9111 1.8720 1.1636 1.8511 2.8920 2.1554 2.2342 2.9359 1.5570 2.2838 2.0724 1.2258 1.9735 2.3841 1.9103 2.4024 1.5139 1.5636 2.1967 1.6879 1.3996 1.6367 1.3704 1.3752 2.6004 1.4721 1.5061 2.8251 1.8329 1.6771 3.1203 6.6214 1.2585 1.2225 1.3662 4.7893 3.8178 2.7136 1.1285 3.2748 1.1601 1.0581 1.1950 2.3522 1.0962 1.0506 1.0620 1.0662 1.0997 5.9061 6.8363 2.4669 1.6256 2.7491 6.2742 7.3487 1.0775 1.0682 1.0680 1.0483 1.0598 1.0388 1.0381 1.0605 1.0988 1.0978 1.1023 1.0991 1.0989 1.0993 1.0987 1.0989 1.0984 1.0815 1.0864 1.0908 1.0907 1.0944 1.0995 1.0594 1.0675 1.0944
irintensity: 0.1862 0.4093 0.2738 0.0377 0.7178 1.8093 0.9736 0.5027 0.7085 1.3480 0.3832 0.4948 0.1191 11.7329 2.8566 30.0912 2.0155 0.4013 0.3797 0.1868 8.1021 4.5106 4.3145 11.0478 31.2434 6.2483 2.8996 7.4857 11.5284 0.6750 2.8682 2.1432 12.8086 24.9955 13.1905 3.0591 24.2026 14.1162 15.7154 7.5004 15.3796 16.3074 2.9918 0.2209 33.7629 3.2153 8.4676 177.3356 8.5309 12.8436 4.8851 2.5759 20.4785 37.5614 11.5133 62.2842 13.2937 2.5955 1.8994 14.7787 0.0903 53.9646 68.6717 7.0344 30.3376 17.8747 183.8609 43.3163 15.5909 4.1885 1.5959 1.3205 5.3129 2.1158 4.8012 66.4160 15.2543 15.2422 22.0383 4.6518 10.4607 5.1011 0.0081 46.2223 1.5185 86.9033 8.6849 2.4751 5.4293 12.3772 37.7520 9.1764 1.4500 15.3860 15.3713 1.4071 4.6223 4.6222 5.5203 6.3514 8.2136 88.1616 2.1685 38.9209 110.5671 2.0102 56.3751 347.6597 48.4393 3.7368 109.9612 13.0721 3.0943 60.6329 12.4466 19.5973 9.9771 17.7793 43.4292 55.3046 3.2149 4.2944 15.1245 9.6867 0.6030 4.5106 14.2740 3.3543 22.0521 6.2704 19.4277 27.2319 68.0166 620.1935 20.5875 231.8708 61.2271 3.8262 68.5848 7.0166 37.5399 12.0179 18.4732 70.5522 46.0157 19.3750 22.7129 36.3100 28.3928 36.6290 45.8718 40.1738 24.9124 49.8973 67.6856 35.4526 27.7735 4.1524 15.1032 9.3027 1.4132 34.6858 50.5281 90.7228 164.8746
temp: 298.150 k
press: 1.00000 atm
elementType: 16 8 8 8 8 8 7 7 6 6 6 6 6 6 6 6 6 6 6 6 6 6 6 6 6 6 6 6 6 6 6 1 1 1 1 1 1 1 1 1 1 1 1 1 1 1 1 1 1 1 1 1 1 1 1 1 1
symmnumber: 1
zpe: 1181248.8 jmol-1
zpe.correction: 0.449914 hartree
zpe.thermalcorrener: 0.479341 hartree
zpe.thermalcorrenthalpy: 0.480285 hartree
zpe.thermalcorrgfe: 0.390326 hartree
zpe.sumelectzpe: -1773.351619 hartree
zpe.sumelectthermal: -1773.322192 hartree
zpe.sumelectthermalent: -1773.321248 hartree
zpe.sumelectthermalfe: -1773.411206 hartree
dipole: 1.9358 -2.7523 1.0387
dipole: 3.5216
quadrupole: -177.8771 -190.1194 -194.4073
quadrupole: 4.3562 1.1701 10.1679
quadrupole: 9.5908 -2.6514 -6.9394 4.3562 1.1701 10.1679
hfenergy: -1773.8015327 hartree
pointgroup: C01 [X(C23H26N2O5S1)]
dipole: 0.6847351 -1.1482343 0.363752 debye
polarizability: 491.9897973|60.0278698|414.1390246|6.6785828|7.70381|180.9368866 unknown
InChI: InChI=1S/C23H26N2O5S/c1-12-8-9-17(23(2,3)11-12)25-15-10-16(31(28,29)30)20(24)19-18(15)21(26)13-6-4-5-7-14(13)22(19)27/h4-7,10,12,17,25,28H,8-9,11,24H2,1-3H3
charge 0 multiplicity 1
57 atoms
S  0.489914 4.242194 0.247556
O  -0.626295 -2.551478 -0.038664
O  -4.373596 1.519607 -0.098666
O  0.349814 4.3535 2.095961
O  2.051627 4.258611 -0.163901
O  -0.523079 5.345019 -0.390446
N  1.308826 -0.861548 0.065424
N  -2.522683 3.310417 -0.014753
C  3.474432 -1.934963 0.70667
C  2.771722 -0.676498 0.084533
C  5.013726 -1.678288 0.667245
C  5.586703 -1.337228 -0.730825
C  3.312334 -0.327029 -1.331594
C  4.840878 -0.110802 -1.311533
C  3.03934 -2.091748 2.187984
C  3.122101 -3.24216 -0.057299
C  7.10933 -1.093919 -0.661416
C  0.366357 0.132466 0.054153
C  -1.05091 -0.166245 0.005525
C  0.759009 1.511805 0.113645
C  -2.027711 0.896684 -0.014012
C  -0.200355 2.507115 0.101401
C  -1.621559 2.28566 0.030121
C  -1.481388 -1.571241 -0.042424
C  -3.46946 0.591505 -0.077857
C  -2.928257 -1.877021 -0.101015
C  -3.891679 -0.829357 -0.119519
C  -3.35797 -3.229099 -0.140593
C  -5.27398 -1.145113 -0.177486
C  -4.729996 -3.533698 -0.197561
C  -5.691635 -2.487881 -0.216238
H  3.015175 0.173187 0.759669
H  5.527066 -2.571732 1.076515
H  5.252216 -0.83721 1.354303
H  5.406836 -2.199841 -1.406712
H  2.802693 0.5820 -1.705425
H  3.049712 -1.142959 -2.032015
H  5.202127 0.106022 -2.33549
H  5.082498 0.780814 -0.694197
H  3.281294 -1.183691 2.772851
H  1.95348 -2.275374 2.277372
H  3.567156 -2.944361 2.654557
H  3.332591 -3.176526 -1.138736
H  3.722931 -4.077442 0.34794
H  2.059659 -3.522826 0.06368
H  0.889348 -1.816143 0.009328
H  7.524525 -0.860208 -1.659613
H  7.341643 -0.242486 0.007474
H  7.641656 -1.982197 -0.272748
H  1.81454 1.793156 0.162665
H  -2.200504 4.281629 -0.086922
H  -3.517997 3.021237 -0.058906
H  -2.595036 -4.012912 -0.125701
H  -5.990677 -0.318704 -0.19068
H  -5.058621 -4.578075 -0.227858
H  -6.759266 -2.728144 -0.26127
H  0.612894 5.282619 2.3640
