program: Gaussian 09
title: 000165890
version: EM64L-G09RevD.01
frameworkgroup: C1[X(C13H18N4O3)]
method: RPBEPBE
basis: SDD
operation: Freq
keyword: #p
keyword: freq=noraman
keyword: PBEPBE/SDD
title: #p freq=noraman PBEPBE/SDD
converged: YES YES NO NO
title: Mulliken charges:
elementType: O O O N N N N C C C C C C C C C C C C C H H H H H H H H H H H H H H H H H H
charge: -0.278583 -0.342653 -0.323614 -0.428756 -0.393912 -0.600063 -0.658164 -0.429497 -0.163856 -0.346830 -0.397187 0.194536 0.172718 0.280293 0.265091 -0.366907 -0.352835 -0.225721 -0.235880 -0.224431 0.256325 0.192064 0.272052 0.205715 0.221383 0.262746 0.207997 0.366591 0.336743 0.347268 0.326091 0.271373 0.233034 0.233318 0.233938 0.234540 0.327565 0.327506
chargesum: 0.00000
title: Mulliken charges with hydrogens summed into heavy atoms:
elementType: O O O N N N N C C C C C C C C C C C C C
charge: -0.278583 -0.342653 -0.323614 -0.062165 -0.057169 0.073297 -0.003092 0.018892 0.108196 0.080269 0.073556 0.194536 0.172718 0.280293 0.265091 -0.095534 -0.119801 0.007597 -0.001941 0.010108
polarizability: 2.34505814e+02 -5.40232780e+00 1.38137857e+02 -4.72550739e+00 1.35900769e+01 1.48828143e+02
1716.lowfreq: -9.4618 -3.9399 0.0001 0.0005 0.0008 7.2504 8.2460 27.1804 36.2419
frequency: 6.9981 27.1155 36.1759 42.2396 47.8431 69.4146 83.8213 95.0643 102.1935 126.4357 159.5900 197.9576 222.3317 252.1080 266.2056 302.8662 309.0303 341.9107 399.8388 400.8566 405.2671 422.7949 446.7866 461.4819 478.6981 497.0176 523.8760 532.5502 567.9929 610.0767 613.8998 631.1458 659.1557 670.0399 691.2301 705.7651 715.0015 728.2041 737.5033 745.3438 793.7219 802.5241 834.0069 858.3052 863.1953 932.4958 936.6181 944.5115 987.1109 990.0847 1006.1754 1019.9561 1031.1917 1032.9884 1048.4865 1061.5134 1080.3909 1084.9161 1102.1937 1150.1058 1173.5346 1177.5405 1192.2906 1203.3557 1213.3759 1248.0635 1265.7821 1278.9529 1302.9031 1317.8489 1322.5421 1324.2014 1359.6700 1364.9278 1384.5773 1387.4995 1433.5183 1460.2671 1470.4722 1473.5502 1478.3173 1503.1806 1537.1978 1549.2576 1590.1282 1596.8738 1609.3744 1611.0347 1647.4173 1651.4471 2951.2568 2959.8005 2986.7041 2993.7216 3050.5468 3064.3469 3069.5553 3126.6378 3133.0231 3145.3125 3156.4150 3169.1333 3414.3766 3459.0792 3523.6126 3526.5909 3673.5641 3696.5948
redmass: 5.9825 5.0082 4.2927 5.4689 5.0895 6.2541 5.6277 4.1666 4.4179 7.5045 4.7650 4.5652 4.1150 4.7870 4.4137 2.3189 7.0078 2.7603 2.2340 2.6386 4.2329 1.3770 2.8420 1.1686 2.2963 2.1699 2.4349 1.5008 3.9434 3.3881 6.4108 1.7145 4.6542 1.3794 3.2170 1.5855 9.0345 3.7136 1.6038 1.1627 2.3964 3.8081 2.5378 1.2776 3.5854 2.6131 1.5966 2.1380 1.7411 3.2193 1.3370 2.7104 1.9126 2.2046 1.9328 2.0947 2.3052 1.6431 2.7731 2.7345 1.1533 2.2734 1.1510 1.4839 1.2820 1.2748 1.3006 1.3799 1.8726 1.4197 1.3778 1.5532 1.5892 1.4516 8.7188 2.7984 2.2434 1.0826 1.8817 1.2394 1.0904 2.3524 2.0222 5.8277 1.8808 3.0046 1.3242 5.7225 2.7723 4.2023 1.0809 1.0691 1.0666 1.0639 1.0974 1.0952 1.0950 1.0863 1.0875 1.0918 1.0960 1.1015 1.0768 1.0793 1.0451 1.0473 1.1043 1.1025
irintensity: 1.2822 0.5218 0.4168 3.5898 6.5795 1.5539 12.2335 1.1711 9.2436 14.9504 7.0891 8.4777 13.4284 8.3549 0.3430 7.0054 4.0082 1.0456 11.2336 3.0755 2.6002 49.0716 13.7687 242.7536 8.6260 1.3993 38.4774 156.2182 21.3096 22.6324 0.1632 86.9332 25.2518 265.7861 26.1523 83.9628 15.8916 1.9639 34.5988 111.6980 20.7606 7.3138 4.2850 0.3428 19.0528 6.5028 3.0846 0.5348 2.6744 0.2410 1.5356 1.2731 1.0947 5.9229 10.2428 2.3912 10.8353 5.5215 25.2232 15.7769 1.2433 1.5892 4.1703 3.2406 9.8228 40.4301 23.1277 13.1932 48.0870 11.6451 22.4336 95.3118 5.6849 27.9540 2.8713 221.1536 3.7921 6.7662 100.9671 108.4060 24.8292 261.2261 451.3726 156.5609 69.5197 3.7966 66.1795 6.8274 206.0464 299.5631 22.6359 66.0368 49.4238 45.4180 40.6544 5.1612 26.2611 4.0061 2.0086 13.3242 18.8400 21.8991 152.4426 100.5273 50.3155 32.8146 37.4760 42.9923
temp: 298.150 k
press: 1.00000 atm
elementType: 8 8 8 7 7 7 7 6 6 6 6 6 6 6 6 6 6 6 6 6 1 1 1 1 1 1 1 1 1 1 1 1 1 1 1 1 1 1
symmnumber: 1
zpe: 808219.2 jmol-1
zpe.correction: 0.307834 hartree
zpe.thermalcorrener: 0.327858 hartree
zpe.thermalcorrenthalpy: 0.328802 hartree
zpe.thermalcorrgfe: 0.255633 hartree
zpe.sumelectzpe: -949.430037 hartree
zpe.sumelectthermal: -949.410014 hartree
zpe.sumelectthermalent: -949.409070 hartree
zpe.sumelectthermalfe: -949.482239 hartree
dipole: -3.1115 -4.8603 2.4886
dipole: 6.2847
quadrupole: -72.1579 -144.1481 -123.6558
quadrupole: -0.5867 -4.2092 7.9593
quadrupole: 41.1627 -30.8275 -10.3352 -0.5867 -4.2092 7.9593
hfenergy: -949.7378719 hartree
pointgroup: C01 [X(C13H18N4O3)]
dipole: 0.6151295 2.1825822 -0.9857225 debye
polarizability: 186.3972795|-48.462935|185.7640305|14.439409|4.3080948|149.3105037 unknown
InChI: InChI=1S/C13H18N4O3/c14-11(18)10(7-4-8-16-13(15)20)17-12(19)9-5-2-1-3-6-9/h1-3,5-6,10,16-17H,4,7-8,14-15H2
charge 0 multiplicity 1
38 atoms
O  0.048702 3.515693 1.159631
O  -0.088259 -0.337945 -1.880812
O  -2.683633 -3.089666 1.365322
N  0.218561 1.348679 -0.299462
N  -2.432299 -1.486877 -0.336698
N  -1.727461 4.447838 -0.000664
N  -1.037486 -3.365717 -0.273797
C  -2.266455 1.545555 -0.79007
C  -0.868008 2.234207 -0.736876
C  -2.709095 0.838697 0.52113
C  -3.380442 -0.531507 0.244116
C  -0.812352 3.448309 0.228054
C  0.551729 0.150274 -0.879328
C  1.72866 -0.575142 -0.280597
C  -2.0915 -2.667834 0.321104
C  2.41605 -1.503506 -1.104012
C  2.151971 -0.388997 1.061657
C  3.522099 -2.22011 -0.60232
C  3.25368 -1.114017 1.565041
C  3.945026 -2.026071 0.734257
H  -2.208396 0.820556 -1.61942
H  -3.021535 2.296227 -1.098584
H  -0.647971 2.605905 -1.761391
H  -3.408984 1.481045 1.089632
H  -1.832197 0.661932 1.171834
H  -3.750194 -0.985655 1.18017
H  -4.252815 -0.392784 -0.428324
H  0.775613 1.747329 0.470354
H  -1.866269 -1.191293 -1.139609
H  -1.71379 5.267879 0.605483
H  -2.428917 4.385582 -0.736021
H  2.06906 -1.641944 -2.133682
H  1.609939 0.286668 1.733905
H  4.053812 -2.926877 -1.248691
H  3.565446 -0.974945 2.605702
H  4.800688 -2.585875 1.127604
H  -0.750918 -4.233378 0.169849
H  -0.47706 -2.973435 -1.029989
