program: Gaussian 09
title: 000165863
version: EM64L-G09RevD.01
frameworkgroup: C1[X(C6H12O6)]
method: RPBEPBE
basis: SDD
operation: Freq
keyword: #pfreq=noraman
keyword: PBEPBE/SDD
title: #p freq=noraman PBEPBE/SDD
converged: YES YES NO NO
title: Mulliken charges:
elementType: O O O O O O C C C C C C H H H H H H H H H H H H
charge: -0.450335 -0.492599 -0.478493 -0.492570 -0.452962 -0.201569 -0.121194 -0.117854 -0.071903 -0.137827 -0.391333 -0.079674 0.224612 0.263008 0.221419 0.257809 0.235468 0.228598 0.365263 0.389372 0.209827 0.368267 0.375396 0.349273
chargesum: 0.00000
title: Mulliken charges with hydrogens summed into heavy atoms:
elementType: O O O O O O C C C C C C
charge: -0.085071 -0.103227 -0.110225 -0.117174 -0.103689 -0.201569 0.103417 0.145154 0.149516 0.119982 0.072732 0.130154
polarizability: 1.05350731e+02 -5.90014051e+00 8.35450931e+01 3.23831298e+00 2.47025154e+00 6.91987279e+01
1716.lowfreq: -0.0012 -0.0012 -0.0011 3.7723 9.7138 14.9371 41.1346 54.6692 72.5329
frequency: 41.0247 54.4942 72.5131 100.0269 113.2231 129.0322 166.6116 236.1346 264.5740 284.5209 299.9115 306.2113 324.0272 352.0576 411.5865 455.5625 468.9014 521.5088 552.2119 561.3773 593.0288 625.4733 692.7879 742.2292 818.6847 855.2797 885.4147 932.2093 942.2435 993.8616 1007.4287 1019.1798 1044.2552 1070.0625 1080.4593 1089.3308 1149.2941 1184.1981 1206.7753 1237.7977 1252.3561 1288.5831 1293.5238 1299.8673 1327.8595 1342.1253 1348.1409 1358.6499 1360.0239 1373.0182 1382.2289 1418.1018 1454.1051 1611.8853 2951.3987 2964.2173 2987.5311 3019.7286 3027.9224 3032.4087 3097.7334 3414.9026 3416.3426 3450.7383 3488.2706 3565.7827
redmass: 7.1241 5.4112 5.6483 3.0839 4.7882 6.0088 5.3762 4.9247 5.2642 4.9441 6.1356 1.1756 5.0932 3.4962 3.2859 3.6540 1.5696 1.8506 1.1343 2.2715 1.2964 1.2274 3.4617 3.8988 2.3641 2.6536 4.0113 3.4225 3.4931 3.5439 2.9952 1.8913 4.3188 2.2578 2.5789 3.2448 1.5436 1.1800 1.4034 1.1568 1.2838 1.2164 1.2083 1.2388 1.2621 1.1693 1.2086 1.1785 1.2761 1.3736 1.3943 1.6295 1.0831 8.0733 1.0838 1.0873 1.0841 1.0592 1.0855 1.0863 1.1068 1.0642 1.0644 1.0647 1.0650 1.0664
irintensity: 0.8798 2.7615 3.7572 9.7005 6.8046 4.4679 7.9207 3.7344 11.4487 14.7582 28.6584 85.3515 18.0756 3.6869 6.6286 11.0119 46.7240 10.7058 183.0842 17.2714 134.0400 257.9362 65.3476 32.4962 34.0645 6.9722 61.7738 58.3656 54.6273 34.5120 26.0006 19.8758 130.1010 49.3672 18.8810 5.9528 35.3111 28.1496 38.2525 12.2944 45.7780 52.6980 56.5308 22.9356 5.6463 21.8119 17.2243 11.5814 116.2939 60.0252 28.9939 2.1496 7.4940 131.0019 31.7509 37.6200 19.0876 24.4668 16.3880 33.1707 24.7764 67.6889 51.3374 56.9718 29.6673 9.5255
temp: 298.150 k
press: 1.00000 atm
elementType: 8 8 8 8 8 8 6 6 6 6 6 6 1 1 1 1 1 1 1 1 1 1 1 1
symmnumber: 1
zpe: 492938.9 jmol-1
zpe.correction: 0.187751 hartree
zpe.thermalcorrener: 0.201397 hartree
zpe.thermalcorrenthalpy: 0.202341 hartree
zpe.thermalcorrgfe: 0.147025 hartree
zpe.sumelectzpe: -686.143532 hartree
zpe.sumelectthermal: -686.129886 hartree
zpe.sumelectthermalent: -686.128942 hartree
zpe.sumelectthermalfe: -686.184257 hartree
dipole: 1.2706 -1.0271 -0.1956
dipole: 1.6455
quadrupole: -73.8743 -76.6110 -71.3740
quadrupole: -2.3935 -4.3480 4.0186
quadrupole: 0.0788 -2.6579 2.5791 -2.3935 -4.3480 4.0186
hfenergy: -686.3312828 hartree
pointgroup: C01 [X(C6H12O6)]
dipole: -0.5112047 0.3282071 0.2237799 debye
dipolederiv: -0.7355964 -0.0067116 0.0212484 -0.0206901 -0.3092465 -0.1262643 -0.0290252 -0.1531823 -0.6999442 -0.5513843 0.0546833 -0.0026384 0.0142385 -0.8524263 -0.0335369 -0.0404972 0.0328521 -0.5038469 -0.399785 -0.0358959 0.0092575 -0.0844636 -0.5531154 -0.058721 -0.0299481 -0.0649385 -0.7849344 -0.7888969 -0.1290222 -0.0515406 -0.1736493 -0.5501339 0.0873909 -0.0803249 0.0682116 -0.3997103 -0.9868956 -0.0807898 -0.030243 -0.0894252 -0.1713976 0.1227157 -0.0772733 0.0999073 -0.5405416 -0.7553057 0.1718291 0.2447822 0.0333642 -0.480008 -0.0526789 0.3583624 -0.2144849 -0.4772717 0.3428851 -0.0305129 0.0076389 0.0635399 0.2726193 0.1205803 0.1296584 0.1752151 0.4622538 0.3786265 -0.1881373 -0.0102427 -0.0266583 0.5376383 0.0888552 0.0441217 -0.056654 0.1992276 0.0720599 0.0280547 -0.0151307 -0.0447007 0.3756461 0.1119145 0.1266176 0.1293862 0.3880032 0.1837873 0.4123893 0.105444 0.397709 -0.1080716 -0.2554456 0.122365 -0.2749193 0.1449601 0.608347 -0.0276825 0.1651066 -0.037223 0.2180377 -0.0488215 0.0608132 -0.05537 0.2585076 0.7047766 -0.0882837 -0.3734349 -0.2484182 0.6980759 0.2451386 -0.5701017 0.3522738 0.4316974 0.0569212 0.0400938 -0.0128996 0.0603865 -0.1327041 -0.0217787 -0.019866 -0.0058394 0.0348392 0.0745078 0.0373697 0.0333085 0.0318989 0.0048796 -0.008682 -0.0040912 -0.0330469 -0.0910482 0.0322495 0.047828 0.0046514 0.0592883 -0.1768196 -0.0272898 0.0027621 -0.0028253 -0.01336 0.1184756 -0.0653171 0.00519 -0.0268705 0.0184457 0.0181413 -0.023797 0.0787882 -0.031883 0.0293982 0.0254589 0.0256083 0.0275204 0.0557812 -0.1003006 0.0137926 -0.058051 -0.1031969 0.0260882 0.048585 -0.0337445 0.0297758 -0.1014104 0.0572993 -0.0321081 0.0056854 0.0770557 0.426206 -0.0011466 -0.0685773 0.0146177 0.1810088 0.0130136 -0.0794171 0.0589822 0.3486998 0.309996 -0.0899736 0.0285495 -0.079341 0.415563 0.0028653 0.0844086 -0.0241812 0.3111896 0.0030054 -0.1490498 0.0469598 -0.135232 -0.0843065 0.0082784 0.0639442 0.0089269 0.0761051 0.1739029 -0.0151747 -0.1040586 0.0219207 0.3343286 -0.0284968 -0.0603841 -0.0191396 0.3533139 0.3078137 0.0058939 0.0426969 0.1191546 0.3719652 -0.0647696 0.0812329 0.0139894 0.2631069 0.368817 0.035512 -0.0379317 0.0932574 0.0356505 -0.0494072 -0.0412448 -0.061586 0.2967772 unknown
polarizability: 104.9954726|-0.691358|79.7228087|-7.8638263|6.3771441|73.376271 unknown
InChI: InChI=1S/C6H12O6/c7-1-3(9)5(11)6(12)4(10)2-8/h1,3-6,8-12H,2H2
charge 0 multiplicity 1
24 atoms
O  -0.634536 0.367693 1.921807
O  0.480404 2.034971 0.202724
O  -1.73649 -0.469798 -1.5342
O  2.962083 1.188052 0.05569
O  -4.270927 -0.498838 -0.38216
O  3.449754 -1.151398 -1.166126
C  -0.56688 -0.09931 0.535782
C  0.594364 0.621776 -0.184673
C  -1.901936 0.128028 -0.200289
C  1.997073 0.117927 0.291075
C  -3.088931 -0.541559 0.511441
C  2.420796 -1.143419 -0.442492
H  -0.380375 -1.188833 0.577151
H  0.488991 0.513361 -1.28063
H  -2.087498 1.221399 -0.296371
H  1.942638 -0.0798 1.38171
H  -3.287531 -0.069577 1.49063
H  -2.89308 -1.61743 0.655753
H  -0.391236 1.337048 1.875694
H  1.392794 2.425418 0.09388
H  1.778432 -2.043967 -0.325386
H  -2.655907 -0.640587 -1.876347
H  3.632617 0.846282 -0.6028
H  -4.68422 0.400361 -0.337363
