program: Gaussian 09
title: 000165849
version: EM64L-G09RevD.01
frameworkgroup: C1[X(C16H10O2)]
method: RPBEPBE
basis: SDD
operation: Freq
keyword: #pfreq=noraman
keyword: PBEPBE/SDD
title: #p freq=noraman PBEPBE/SDD
converged: YES YES NO YES
title: Mulliken charges:
elementType: O O C C C C C C C C C C C C C C C C H H H H H H H H H H
charge: -0.431239 -0.413604 0.042071 0.015327 0.262758 0.392441 0.509228 0.500454 -0.441827 -0.425112 -0.535041 -0.474080 0.109362 0.033497 -0.471820 -0.465746 -0.430236 -0.383290 0.271339 0.182221 0.239048 0.240300 0.241827 0.244039 0.218172 0.250077 0.361306 0.358528
chargesum: 0.00000
title: Mulliken charges with hydrogens summed into heavy atoms:
elementType: O O C C C C C C C C C C C C C C C C
charge: -0.069933 -0.055077 0.042071 0.015327 0.262758 0.392441 0.509228 0.500454 -0.170488 -0.242891 -0.295993 -0.233780 0.109362 0.033497 -0.229993 -0.221707 -0.212064 -0.133214
polarizability: 3.10546586e+02 1.58946519e+01 2.16824483e+02 -7.11022464e-03 -5.73920486e-03 6.77225790e+01
1716.lowfreq: -14.2617 -0.0010 -0.0002 0.0003 4.6416 8.0418 70.0812 112.4789 130.7530
frequency: 70.0773 112.4787 130.7519 202.7786 236.7104 260.5149 263.0013 298.4513 302.7941 347.0466 359.8123 392.5451 420.9005 429.4695 443.8701 496.0829 511.0814 511.1618 527.6667 531.5767 545.7225 594.3329 639.9369 672.5181 683.1877 684.1444 725.1533 754.1440 770.2633 786.1620 813.2316 815.2807 820.6576 833.2580 867.1684 921.4815 957.2280 958.7582 966.2586 979.1453 991.3706 1088.8477 1107.4111 1134.6294 1150.6070 1167.4412 1172.3545 1193.9701 1205.8811 1239.6424 1248.3632 1260.2516 1298.2930 1334.6590 1383.7952 1402.8858 1409.6563 1421.4196 1435.1835 1440.0371 1467.9763 1503.5867 1514.4623 1558.5673 1602.1671 1607.5384 1613.2854 1636.0798 3089.7678 3112.9120 3129.0446 3136.2219 3136.9123 3144.8100 3172.2063 3175.6470 3585.3586 3589.2208
redmass: 5.6683 4.3111 4.0117 3.8422 6.1885 4.2555 2.4583 6.2508 1.9071 1.6701 1.7724 6.8383 7.7058 6.4118 3.4896 5.2318 3.5732 4.9670 5.1019 4.6757 3.1031 5.6339 4.4486 5.6532 7.0346 3.3628 2.2915 6.1109 6.1887 1.5357 1.8502 5.8091 1.9448 2.6775 1.6148 1.3490 1.3871 1.3990 4.5489 4.1689 1.3528 2.0099 2.5637 1.5389 1.2412 1.4411 1.6037 1.2925 1.9005 1.6735 1.7361 2.9592 2.1361 3.2644 3.0914 3.6315 2.3419 7.1523 3.9243 3.0532 5.0627 5.7440 3.9136 5.3076 7.6712 6.3478 7.0742 7.4864 1.0870 1.0881 1.0894 1.0894 1.0954 1.0955 1.0954 1.0952 1.0660 1.0654
irintensity: 1.7659 0.0934 2.3791 2.7838 0.6816 7.6285 28.7676 14.1190 106.1558 28.5485 101.5172 7.6088 0.8743 3.0209 0.1080 4.5835 0.3576 4.7876 5.0178 10.7211 3.1873 13.7498 0.2750 1.2591 3.0141 8.4782 20.4362 6.6911 30.2597 0.8761 1.6605 37.4125 55.9795 28.7772 93.2728 0.7047 3.6255 1.5005 4.2808 40.7485 0.0472 17.3094 40.1146 422.7052 32.5355 17.8677 0.4322 114.2384 11.2495 11.4215 59.2064 69.2549 1.6652 0.9750 31.3263 10.4968 18.8029 3.7571 55.9012 19.9584 5.6597 145.1781 4.4133 6.8339 25.7154 35.6541 35.4344 0.7376 17.3468 22.2805 9.4454 17.6647 17.0187 23.4117 12.7818 8.2871 68.8334 33.5128
temp: 298.150 k
press: 1.00000 atm
elementType: 8 8 6 6 6 6 6 6 6 6 6 6 6 6 6 6 6 6 1 1 1 1 1 1 1 1 1 1
symmnumber: 1
zpe: 553268.5 jmol-1
zpe.correction: 0.210729 hartree
zpe.thermalcorrener: 0.223652 hartree
zpe.thermalcorrenthalpy: 0.224597 hartree
zpe.thermalcorrgfe: 0.172314 hartree
zpe.sumelectzpe: -764.987171 hartree
zpe.sumelectthermal: -764.974248 hartree
zpe.sumelectthermalent: -764.973304 hartree
zpe.sumelectthermalfe: -765.025586 hartree
dipole: 2.2583 2.1158 -0.0016
dipole: 3.0946
quadrupole: -87.7310 -87.4471 -110.3672
quadrupole: 2.3447 0.0131 -0.0069
quadrupole: 7.4508 7.7347 -15.1854 2.3447 0.0131 -0.0069
hfenergy: -765.1979003 hartree
pointgroup: C01 [X(C16H10O2)]
dipole: 0.9157803 0.8023029 0.0013017 debye
polarizability: 311.4860774|12.7425293|215.8606265|1.9917393|-0.988278|67.7469446 unknown
InChI: InChI=1S/C16H10O2/c17-13-8-4-10-2-6-12-14(18)7-3-9-1-5-11(13)16(10)15(9)12/h1-8,17-18H
charge 0 multiplicity 1
28 atoms
O  4.113441 -1.229617 0.029462
O  -4.222774 1.104487 -0.060451
C  0.686943 0.233973 -0.010144
C  -0.680483 -0.216387 -0.018416
C  1.755921 -0.73317 0.0059
C  -1.75559 0.74863 -0.034779
C  0.983542 1.648017 -0.018003
C  -0.968218 -1.630174 -0.010373
C  1.444973 -2.14307 0.013739
C  -1.427253 2.158358 -0.041627
C  -0.112304 2.588566 -0.033603
C  0.128366 -2.570062 0.005865
C  3.099155 -0.255248 0.013579
C  -3.098929 0.26188 -0.043295
C  2.33917 2.068785 -0.009849
C  -2.326214 -2.054773 -0.018806
C  3.387584 1.128001 0.005726
C  -3.376503 -1.12335 -0.035076
H  2.273259 -2.856195 0.025935
H  -2.221745 2.917074 -0.05278
H  0.118032 3.660245 -0.038695
H  -0.104882 -3.64129 0.011822
H  2.570152 3.139754 -0.015817
H  -2.552034 -3.126971 -0.012477
H  4.430461 1.471102 0.011857
H  -4.423034 -1.44127 -0.041946
H  5.007042 -0.805989 0.03441
H  -3.962279 2.058094 -0.06736
