program: Gaussian 09
title: 000165844
version: EM64L-G09RevD.01
frameworkgroup: C1[X(C9H14N4O4)]
method: RPBEPBE
basis: SDD
operation: Freq
keyword: #p
keyword: freq=noraman
keyword: PBEPBE/SDD
title: #p freq=noraman PBEPBE/SDD
converged: YES YES NO NO
title: Mulliken charges:
elementType: O O O O N N N N C C C C C C C C C H H H H H H H H H H H H H H
charge: -0.272454 -0.457836 -0.434949 -0.458513 -0.207333 -0.076994 -0.528457 -0.625704 -0.156168 -0.158060 -0.080516 -0.121449 -0.389552 -0.028708 0.082639 -0.401552 0.192806 0.241341 0.273426 0.264506 0.280975 0.270612 0.212697 0.384772 0.349036 0.337389 0.350883 0.232909 0.268744 0.321046 0.334465
chargesum: 0.00000
title: Mulliken charges with hydrogens summed into heavy atoms:
elementType: O O O O N N N N C C C C C C C C C
charge: -0.272454 -0.073063 -0.085913 -0.107631 -0.207333 -0.076994 -0.259714 0.029807 0.085172 0.115366 0.183990 0.159526 0.093757 0.308682 0.082639 -0.168643 0.192806
polarizability: 1.89356343e+02 1.49936765e+01 1.43622046e+02 1.18331249e+00 -4.68471245e+00 9.16185309e+01
1716.lowfreq: -15.3763 -12.8285 -4.2278 0.0006 0.0010 0.0010 44.2354 56.4221 87.9521
frequency: 44.1785 56.3864 87.9421 106.0386 129.0047 159.9071 188.5667 195.0145 215.0635 256.6384 274.2544 285.5184 307.6762 326.4948 370.9958 375.1318 390.6124 425.6974 430.6447 442.5286 469.9903 533.3467 549.0269 554.8597 571.3372 588.5015 678.4545 690.5149 729.8818 751.0307 755.1889 776.6642 777.7011 780.6659 814.6206 883.5676 915.5451 934.9279 947.4964 960.6339 970.1063 980.4028 991.2978 1021.1553 1042.2482 1060.3887 1075.7286 1080.4877 1098.5077 1149.4528 1182.0834 1183.8830 1195.6136 1207.3312 1234.8111 1244.3586 1265.0958 1285.6219 1294.4552 1307.7905 1331.5743 1339.6618 1342.3793 1364.9926 1371.8617 1413.5483 1450.2617 1474.6760 1495.5081 1498.1341 1574.8110 1621.0290 1636.0862 2539.4662 2958.8258 2989.2303 3027.3432 3031.3111 3087.2552 3113.7372 3171.4120 3189.3269 3450.7019 3532.8725 3547.2917 3573.4433 3703.0643
redmass: 5.7473 4.7285 6.2720 5.8475 3.8895 5.6128 4.4637 4.2449 6.0077 6.3721 1.1414 6.1726 4.3186 4.6811 4.1083 3.5877 1.2653 1.6011 1.6938 4.6018 4.4220 3.1758 2.1195 1.8147 6.3543 5.8074 3.3648 5.0619 3.3111 5.6268 4.4009 1.7505 1.3914 3.5338 4.6991 3.9834 3.1934 2.7125 4.7642 1.8889 2.0755 2.0046 2.6048 4.0947 2.1380 3.2954 2.4996 2.9156 1.3272 1.6455 1.2635 1.3618 1.8593 1.1515 1.2856 1.3656 1.3988 1.9282 1.5139 1.9571 1.1971 1.2754 1.2814 1.7869 1.3448 1.4453 1.4927 1.0770 2.7831 5.5269 3.3208 1.8328 3.6255 1.0729 1.0591 1.0847 1.1026 1.0883 1.0886 1.0882 1.0900 1.0994 1.0749 1.0657 1.0453 1.0665 1.1045
irintensity: 2.7333 3.2135 2.5694 6.8262 4.1241 13.2080 15.0176 6.3332 5.7612 5.0003 156.8139 0.6390 3.7659 14.9745 3.6046 24.0550 126.1878 34.2761 130.8214 17.7491 5.5301 32.7677 69.1188 61.7158 1.7198 3.3112 5.2205 16.3296 11.4797 0.8741 27.0041 142.2641 20.9678 17.5012 3.2937 39.0783 48.8360 31.1771 103.3017 31.2882 27.5704 9.9741 88.7587 22.4618 42.2149 38.7594 21.7956 40.7446 204.4798 44.9194 31.4186 23.7528 157.8507 41.3853 2.5158 17.7514 25.8175 37.6831 33.7374 46.9363 10.4762 16.3667 7.1654 5.1049 65.9104 5.1959 481.5745 11.2838 50.3508 97.6127 237.5056 63.5477 731.5330 976.7401 37.0019 26.3839 20.5283 29.4435 22.0976 9.5535 20.2033 15.1791 22.8676 8.4278 107.9492 4.6808 38.4316
temp: 298.150 k
press: 1.00000 atm
elementType: 8 8 8 8 7 7 7 7 6 6 6 6 6 6 6 6 6 1 1 1 1 1 1 1 1 1 1 1 1 1 1
symmnumber: 1
zpe: 636610.0 jmol-1
zpe.correction: 0.242472 hartree
zpe.thermalcorrener: 0.258249 hartree
zpe.thermalcorrenthalpy: 0.259193 hartree
zpe.thermalcorrgfe: 0.200074 hartree
zpe.sumelectzpe: -869.922041 hartree
zpe.sumelectthermal: -869.906264 hartree
zpe.sumelectthermalent: -869.905320 hartree
zpe.sumelectthermalfe: -869.964439 hartree
dipole: 5.0128 3.9005 -0.2415
dipole: 6.3561
quadrupole: -85.7443 -98.7295 -99.4857
quadrupole: 3.2701 -0.7176 8.9155
quadrupole: 8.9089 -4.0763 -4.8325 3.2701 -0.7176 8.9155
hfenergy: -870.1645132 hartree
pointgroup: C01 [X(C9H14N4O4)]
dipole: 1.6299915 -1.8664446 0.3361694 debye
polarizability: 180.1417414|-25.1598109|147.5612112|-6.6706295|-14.2225237|96.8939672 unknown
InChI: InChI=1S/C9H14N4O4/c10-5-1-2-13(9(11)12-5)8-7(16)6(15)4(3-14)17-8/h1-2,4,6-8,11,14-16H,3,10H2
charge 0 multiplicity 1
31 atoms
O  -1.512648 -0.113788 1.327039
O  -1.119452 1.337968 -1.776717
O  -3.709043 1.838244 0.781524
O  -2.001721 -2.671479 0.028575
N  0.5951 0.087558 0.138364
N  2.904252 0.236855 -0.612572
N  1.298388 1.93287 -1.156633
N  4.396755 -1.504535 -0.229058
C  -1.509868 1.58902 -0.413697
C  -2.94003 1.024818 -0.166959
C  -0.625213 0.836317 0.662356
C  -2.673918 -0.379247 0.405169
C  -2.365117 -1.423142 -0.668364
C  0.816723 -1.209256 0.5610
C  1.633945 0.789278 -0.567131
C  2.044631 -1.822627 0.393631
C  3.112113 -1.016354 -0.15536
H  -1.49703 2.671619 -0.175348
H  -3.518422 1.039617 -1.101287
H  -0.246361 1.528832 1.435616
H  -3.480299 -0.732923 1.06753
H  -1.555629 -1.067065 -1.33511
H  -3.285532 -1.56445 -1.273713
H  -0.135106 1.713137 -1.788137
H  -3.288819 1.754379 1.677219
H  -0.039239 -1.70363 1.027181
H  -1.823633 -3.374844 -0.644678
H  2.194732 -2.853715 0.718537
H  2.113642 2.383392 -1.599634
H  4.635274 -2.432468 0.108478
H  5.119027 -0.903182 -0.621319
