program: Gaussian 09
title: 000165841
version: EM64L-G09RevD.01
frameworkgroup: C1[X(C8H12IN3OS)]
method: RPBEPBE
basis: SDD
operation: Freq
keyword: #p
keyword: freq=noraman
keyword: PBEPBE/SDD
title: #p freq=noraman PBEPBE/SDD
converged: YES YES NO NO
title: Mulliken charges:
elementType: I S O N N N C C C C C C C C H H H H H H H H H H H H
charge: 0.051831 0.210890 -0.170718 -0.052104 -0.357006 -0.005435 -0.343623 -0.438200 -0.336683 -0.092798 -0.692209 -0.112645 0.273111 -0.833314 0.197220 0.220758 0.226880 0.246908 0.195509 0.202947 0.220701 0.211138 0.215152 0.317351 0.322142 0.322197
chargesum: 0.00000
title: Mulliken charges with hydrogens summed into heavy atoms:
elementType: I S O N N N C C C C C C C C
charge: 0.051831 0.210890 -0.170718 -0.052104 -0.039656 -0.005435 0.074355 0.035588 0.061773 -0.092798 -0.045218 -0.112645 0.273111 -0.188975
polarizability: 2.27860056e+02 5.37310560e+00 1.53481942e+02 -8.04880725e+00 1.25634918e+01 9.24401585e+01
1716.lowfreq: -4.4327 -1.5449 -0.0005 0.0019 0.0019 6.6972 8.9919 21.0720 31.1301
frequency: 5.7996 20.9371 31.1086 46.4103 60.9605 78.6424 92.5578 112.8275 127.9225 189.5227 222.5203 234.7589 280.4706 293.5251 338.7875 350.5732 423.5963 472.3526 523.8924 536.2956 558.6343 579.1497 596.7714 616.3520 655.4234 729.1819 733.3877 789.5869 805.8392 835.6053 889.4929 898.4317 919.7972 993.3181 1002.8450 1061.3577 1071.1300 1105.6991 1116.9975 1137.0568 1175.4779 1190.0442 1216.2241 1218.6549 1256.8405 1279.2534 1290.2518 1322.0412 1349.7187 1393.8071 1409.2693 1443.3995 1460.1602 1467.1774 1476.2529 1478.4400 1479.0693 1487.7247 1491.9967 1627.7842 2967.1572 2976.0186 2977.8560 2986.1227 3010.8259 3039.0584 3064.5594 3065.2813 3074.1217 3077.0142 3154.4619 3444.0237
redmass: 8.7875 6.2775 6.8464 3.6983 3.0891 2.2111 3.9235 2.6979 5.0440 4.7536 3.2917 1.1956 7.6774 4.9796 4.7003 4.6809 4.7558 5.9231 3.7785 6.6589 5.0701 5.8505 6.6584 4.8271 1.3905 6.7812 1.0964 1.2233 8.6343 1.7519 3.9286 2.0117 1.4859 4.0406 4.4430 3.4282 2.7122 2.0361 2.4324 1.1782 3.3671 2.1552 1.4277 1.4866 1.2933 1.2036 1.0634 1.3792 1.5531 1.2118 1.0949 1.1916 4.6350 1.0726 1.0671 1.0436 2.6845 1.0834 3.3008 8.0511 1.0590 1.0404 1.0566 1.0635 1.0982 1.1003 1.0582 1.1006 1.1010 1.0994 1.1060 1.0773
irintensity: 1.1781 4.1084 0.7007 5.8376 2.6749 0.8229 0.9438 0.7220 1.4522 1.8876 1.0980 0.0420 2.1164 2.7661 0.5442 2.1403 6.7363 39.7801 12.3634 33.8406 5.4115 7.6839 15.2255 86.3274 69.6512 5.6516 9.8332 1.0775 1.1718 24.5731 11.8284 7.4724 1.1896 31.6000 1.8382 12.2817 11.8256 17.2835 0.9504 10.4910 22.9787 65.1198 24.3239 52.4403 2.1143 2.4019 0.8305 1.8356 0.5027 12.0715 46.5081 8.9614 38.7794 6.1614 3.7869 14.6839 946.0426 17.8515 10.6323 151.2049 19.2690 23.6208 27.9879 39.9365 5.1509 13.2716 0.4696 2.8137 88.5754 50.4146 0.5387 186.9006
temp: 298.150 k
press: 1.00000 atm
elementType: 53 16 8 7 7 7 6 6 6 6 6 6 6 6 1 1 1 1 1 1 1 1 1 1 1 1
symmnumber: 1
zpe: 513733.9 jmol-1
zpe.correction: 0.195671 hartree
zpe.thermalcorrener: 0.211713 hartree
zpe.thermalcorrenthalpy: 0.212657 hartree
zpe.thermalcorrgfe: 0.145525 hartree
zpe.sumelectzpe: -959.998385 hartree
zpe.sumelectthermal: -959.982343 hartree
zpe.sumelectthermalent: -959.981399 hartree
zpe.sumelectthermalfe: -960.048532 hartree
dipole: 0.7431 -4.4213 -0.9117
dipole: 4.5751
quadrupole: -85.6980 -120.7317 -107.1393
quadrupole: -8.1106 -0.7086 -0.2268
quadrupole: 18.8250 -16.2087 -2.6163 -8.1106 -0.7086 -0.2268
hfenergy: -960.1940563 hartree
pointgroup: C01 [X(C8H12I1N3O1S1)]
dipole: 0.6579893 -1.4481101 -0.842583 debye
dipolederiv: -0.2877604 -0.0955887 -0.0329478 -0.3166963 -0.331577 -0.1829285 -0.1807771 -0.1952665 -0.2016116 -0.5791248 -0.0610986 0.0356272 0.0504689 -0.4974622 -0.1587044 0.0950537 -0.1528064 0.0514176 -0.7071136 -0.2586983 -0.1832686 0.3085373 -0.4590109 -0.3235129 0.4650995 -0.2114349 -0.7069134 -0.3125741 -0.1467055 -0.0138676 0.2259293 -0.4044518 -0.0493508 0.012695 -0.0435146 -0.1445322 -2.1623936 -0.2113555 0.2777811 -0.1019067 -0.4026807 -0.0137589 0.5142089 0.0002655 -0.4653223 -0.3857283 0.1783828 0.0158438 -0.2519715 -0.3853834 -0.049934 -0.0644541 -0.0749266 -0.1173033 -0.027535 -0.0047475 0.0096894 -0.1144046 0.1047217 0.0338098 0.1538124 0.0501879 0.121629 -0.2041781 0.0629063 -0.0470839 0.0934882 0.0257801 0.0407507 -0.062857 0.0184022 0.1091249 0.1140122 0.0164551 -0.0155442 0.0952942 0.1257724 0.0677466 -0.1062387 0.0530057 0.1192207 0.7033893 0.1581326 0.0339557 0.2163746 0.6216324 0.2029965 -0.0729813 0.2000085 -0.036777 -0.069093 0.0515613 -0.0525989 0.0196258 0.0447933 0.0439264 -0.0042879 0.0432968 0.0470749 1.7488984 0.0101425 -0.1470005 0.0807818 0.6143381 0.0254038 0.0027362 0.1111664 0.0204301 1.8512142 0.4439278 -0.0329558 -0.7102302 0.2871861 0.3854623 -1.2188239 0.09295 0.8125876 -0.2052545 -0.0289277 0.0176269 0.3631091 0.5310795 0.3765871 0.2996512 0.4351265 0.3092946 0.0144874 -0.0730622 -0.0245747 -0.0982545 -0.1149784 -0.011785 -0.0347622 -0.0394475 0.0507207 0.0411141 0.023977 0.0489422 0.02193 0.0552511 -0.0404082 0.0468282 -0.0181666 -0.1262525 -0.0012061 -0.0052039 0.0437933 0.0190944 0.083245 -0.0706886 0.0500963 -0.014975 -0.0859767 0.0168426 -0.0432318 -0.0039034 -0.0637555 -0.0583409 -0.0048462 -0.0301748 -0.0322085 0.0894953 0.0211793 0.0179132 0.0232089 0.025978 0.0601227 -0.0371682 0.0701505 -0.0193028 -0.1913256 0.0142797 -0.0313559 -0.0139488 -0.0876022 -0.1738662 -0.0117741 -0.0174444 -0.025265 0.0672649 -0.2398901 0.0272809 -0.013551 0.0217146 0.0832694 0.0213118 -0.0014259 0.0178142 0.0828661 0.0806707 -0.1000315 -0.0216618 -0.0416838 -0.151866 -0.014359 -0.0308587 -0.0510507 0.0638142 0.0933176 0.0206405 0.0843792 0.02666 0.0606415 -0.0599883 0.027021 -0.021335 -0.1554947 0.3692581 0.1129532 0.0648835 0.2691845 0.31396 -0.0527008 0.0957399 -0.0352922 0.2444051 0.0360519 -0.0203009 -0.0426267 0.0164024 -0.040487 -0.0160839 -0.0509 -0.0667199 0.0604138 0.077136 -0.0439653 -0.0101975 -0.0680678 0.0083112 -0.1000031 0.0428932 -0.0205114 -0.0182504 unknown
polarizability: 223.626574|17.779257|143.4528992|5.5955284|30.4730945|106.7026835 unknown
InChI: InChI=1S/C8H12IN3OS/c1-2-3-4-7-11-12-8(14-7)10-6(13)5-9/h10H,2-5H2,1H3
charge 0 multiplicity 1
26 atoms
I  -4.90777 -2.13804 -1.469962
S  0.435261 -0.878868 -0.985877
O  -3.194148 0.947604 1.168307
N  0.770547 1.698721 -0.351493
N  -2.28899 -0.215991 -0.674755
N  -0.621289 1.509216 -0.341332
C  3.642475 -0.419075 0.204186
C  2.968594 0.571539 -0.784671
C  5.182818 -0.393003 0.085718
C  1.473989 0.616551 -0.673893
C  5.866655 -1.381199 1.05431
C  -0.974787 0.262241 -0.63449
C  -3.316383 0.162228 0.195109
C  -4.714691 -0.40087 -0.084941
H  3.275311 -1.447551 0.011537
H  3.341359 -0.162711 1.23839
H  3.260781 0.305693 -1.820229
H  3.333145 1.597538 -0.594526
H  5.47444 -0.631497 -0.957606
H  5.546546 0.635173 0.285151
H  6.966813 -1.34281 0.957176
H  5.545805 -2.420856 0.854179
H  5.61187 -1.147585 2.104914
H  -2.520052 -0.937279 -1.36838
H  -5.341693 0.385351 -0.534952
H  -5.158708 -0.733719 0.863531
