program: Gaussian 09
title: 000165802
version: EM64L-G09RevD.01
frameworkgroup: C1[X(H5N2O2P)]
method: RPBEPBE
basis: SDD
operation: Freq
keyword: #pfreq=noraman
keyword: PBEPBE/SDD
title: #p freq=noraman PBEPBE/SDD
converged: YES YES NO NO
title: Mulliken charges:
elementType: P O O N N H H H H H
charge: 1.390247 -0.678155 -0.622407 -0.959429 -0.943902 0.356539 0.365986 0.356998 0.350514 0.383608
chargesum: 0.00000
title: Mulliken charges with hydrogens summed into heavy atoms:
elementType: P O O N N
charge: 1.390247 -0.294546 -0.622407 -0.236903 -0.236390
polarizability: 4.37180644e+01 7.40717406e-01 4.57412771e+01 6.29176657e-01 1.67471871e+00 3.45202580e+01
1716.lowfreq: -12.9451 0.0011 0.0020 0.0026 5.7024 13.5986 212.2668 229.3899 254.0523
frequency: 212.2651 229.3886 254.0475 330.5895 352.4443 364.9359 378.5095 480.5331 507.7718 540.4111 668.4314 790.4528 876.0673 938.5051 994.5449 1008.0260 1113.9867 1557.6167 1569.4728 3542.5266 3557.7125 3595.9246 3695.1028 3704.5367
redmass: 3.7417 2.0727 1.3015 2.3616 3.4958 4.6837 1.4395 1.1180 1.4397 1.2966 7.3338 4.8717 4.1725 1.7916 1.4285 1.4162 2.7365 1.1093 1.1006 1.0443 1.0449 1.0658 1.1028 1.1023
irintensity: 14.9499 2.4772 27.7119 46.0765 8.8371 67.3334 35.3163 13.0740 411.0683 233.3413 177.4254 107.8983 208.7725 39.8693 118.2575 16.0724 217.4159 89.3491 40.8277 36.5163 46.0111 44.0668 42.6100 52.1266
temp: 298.150 k
press: 1.00000 atm
elementType: 15 8 8 7 7 1 1 1 1 1
symmnumber: 1
zpe: 186999.1 jmol-1
zpe.correction: 0.071224 hartree
zpe.thermalcorrener: 0.078084 hartree
zpe.thermalcorrenthalpy: 0.079028 hartree
zpe.thermalcorrgfe: 0.041526 hartree
zpe.sumelectzpe: -603.751819 hartree
zpe.sumelectthermal: -603.744959 hartree
zpe.sumelectthermalent: -603.744015 hartree
zpe.sumelectthermalfe: -603.781518 hartree
dipole: -0.1385 2.6872 1.6157
dipole: 3.1386
quadrupole: -33.5469 -34.6531 -39.6413
quadrupole: -2.6620 -5.6521 -6.7945
quadrupole: 2.4002 1.2940 -3.6942 -2.6620 -5.6521 -6.7945
hfenergy: -603.8230431 hartree
pointgroup: C01 [X(H5N2O2P1)]
dipole: 1.2208996 0.1222502 0.1385687 debye
dipolederiv: 1.9519109 0.0182532 -0.1619562 0.0348798 2.1258076 -0.0791254 -0.2131816 -0.0596534 1.9509076 -0.4852609 -0.1165341 0.05927 -0.1221397 -0.6783144 -0.0061841 0.1445985 -0.0108564 -1.180996 -0.7530523 -0.0003896 -0.0351797 0.0349124 -0.6947272 0.0297406 -0.0026343 0.0066269 -0.7114228 -1.0778503 0.1437801 -0.1445832 0.0546518 -0.9988201 -0.1372351 -0.1666815 -0.0909035 -0.5776707 -0.7710806 -0.2371655 0.2353651 -0.1787423 -0.9280158 -0.0644893 0.1761667 -0.0778655 -0.9677088 0.3521593 0.0638143 0.0587913 0.0927323 0.2187751 0.0173216 0.0524859 0.0575658 0.1841438 0.3051664 0.0723421 0.1013682 0.0407641 0.2044815 0.0519873 0.1009849 0.0123986 0.2506824 0.174641 -0.0338931 -0.0175913 0.0137024 0.2033304 0.074328 -0.0410626 0.0665943 0.3754128 0.1545433 -0.0250858 -0.0694717 -0.0701693 0.2099198 0.0956924 -0.0496123 0.101764 0.3351432 0.1488232 0.1148784 -0.0260126 0.0994085 0.3375631 0.0179641 -0.0010638 -0.0056708 0.3415084 unknown
polarizability: 45.1889748|-2.661798|39.3275707|-1.2825197|-4.4264134|39.463054 unknown
InChI: InChI=1S/H5N2O2P/c1-5(2,3)4/h3H,1-2H2
charge 0 multiplicity 1
10 atoms
P  0.040644 0.072144 -0.112638
O  -0.047204 0.040834 1.634012
O  -1.409651 0.179604 -0.772361
N  1.066414 -1.292536 -0.24082
N  1.06458 1.327736 -0.669768
H  1.529275 -1.506278 -1.121607
H  0.998311 -2.035858 0.451382
H  0.652543 2.148694 -1.109096
H  2.044327 1.369864 -0.393839
H  -0.917237 0.384396 1.961434
