program: Gaussian 09
title: 000165835
version: EM64L-G09RevD.01
frameworkgroup: C1[X(C11H14Cl3N5)]
method: RPBEPBE
basis: SDD
operation: Freq
keyword: #p
keyword: freq=noraman
keyword: PBEPBE/SDD
title: #p freq=noraman PBEPBE/SDD
converged: YES YES NO NO
title: Mulliken charges:
elementType: Cl Cl Cl N N N N N C C C C C C C C C C C H H H H H H H H H H H H H H
charge: -0.077028 -0.080119 0.010435 -0.102826 -0.143886 0.038502 -0.067508 0.095129 -0.503542 -0.328461 -0.328005 0.239977 -0.084470 0.140085 -0.574357 -0.574268 -0.231341 -0.602488 -0.393669 0.237656 0.245768 0.257128 0.234591 0.229891 0.232055 0.268521 0.265120 0.250240 0.311240 0.277205 0.263420 0.232496 0.262507
chargesum: 0.00000
title: Mulliken charges with hydrogens summed into heavy atoms:
elementType: Cl Cl Cl N N N N N C C C C C C C C C C C
charge: -0.077028 -0.080119 0.010435 -0.102826 -0.143886 0.038502 -0.067508 0.095129 -0.020117 0.163258 0.133942 0.239977 -0.084470 0.140085 -0.040716 -0.012788 0.045864 0.155935 -0.393669
polarizability: 2.21831034e+02 2.85110270e+01 2.16633192e+02 -1.29102084e+01 1.46831096e+01 1.24157729e+02
1716.lowfreq: -9.5181 -2.6072 0.0011 0.0015 0.0015 6.1879 9.3178 17.5212 22.4455
frequency: 8.8459 17.2251 22.3978 29.5810 40.3745 60.1221 78.9887 91.7193 100.1598 112.5133 145.9954 167.7404 181.8537 197.9098 204.6303 250.9434 269.6233 291.8694 321.7396 333.9359 348.2266 367.9951 432.6723 456.2762 507.9892 533.3963 584.1775 626.8840 655.7260 660.4595 671.4415 678.7572 712.7843 758.5540 767.0814 778.0184 804.7593 831.4133 846.4902 866.0448 925.1879 985.0820 996.6044 1007.7732 1030.4629 1038.9069 1039.8037 1100.5496 1109.0600 1126.6690 1130.0762 1181.6686 1204.0386 1213.9298 1238.1569 1247.7080 1262.6334 1275.0386 1283.9890 1291.6133 1300.6656 1331.5574 1334.4838 1344.9349 1362.1392 1365.7326 1374.1176 1389.0947 1423.1910 1439.6322 1443.5725 1452.1209 1460.3655 1462.0892 1465.9466 1476.5145 1488.6304 1536.1803 1567.6908 2964.8576 2971.2827 2983.2765 3009.4716 3041.8139 3053.1199 3054.8811 3058.6634 3061.7182 3103.7532 3124.6291 3144.6562 3146.8280 3230.4527
redmass: 12.2278 1.0383 7.8182 8.7137 11.8278 3.5688 3.4163 3.2770 3.8555 4.1848 5.1922 3.5262 4.8697 4.3002 7.6163 4.9433 5.1871 4.2336 4.6973 5.6660 8.1364 18.9718 2.7927 2.4532 6.2153 4.6879 5.4408 4.2740 7.1633 5.8915 7.7606 10.0352 7.4386 10.3226 1.1445 1.1492 5.4251 3.0129 1.9831 7.4427 3.0049 3.4576 1.5227 1.6919 1.9925 3.6732 3.6517 3.1370 1.6238 1.3206 1.4657 2.8174 2.2190 2.2650 1.3193 1.1840 1.4056 2.4839 2.0813 2.5424 5.8184 1.4974 2.1556 2.1804 1.2995 1.4765 1.5325 3.8843 1.5910 1.0811 1.0880 1.0788 1.0883 1.0388 1.0999 2.4692 1.1243 7.2890 7.9716 1.0624 1.0636 1.0609 1.0333 1.1004 1.0649 1.0720 1.0791 1.0979 1.1027 1.1024 1.1123 1.1123 1.0990
irintensity: 0.3968 0.0084 1.4867 0.0677 0.6885 0.6095 0.7027 4.1425 1.0348 1.7362 0.5115 1.8985 2.2090 3.6438 8.6543 3.3120 0.5730 3.4782 14.5396 7.0610 2.6539 3.9492 2.3427 4.0584 20.0960 22.3568 6.3910 22.4551 51.6677 121.3416 7.7621 5.0044 35.3508 11.6979 6.9610 10.5509 10.2245 10.0669 14.9486 21.8922 19.9866 19.1531 4.6721 10.8097 38.2282 10.8706 2.2672 48.7899 31.2855 0.4805 36.9500 49.5376 15.5182 216.2030 10.3162 8.3992 7.5381 11.8464 17.6355 24.5386 83.2605 5.6849 21.5844 37.2718 5.8640 6.8892 13.5531 9.2811 13.2918 14.2576 11.0505 4.3640 11.1164 17.2279 12.3957 85.0942 8.3469 94.9897 146.1601 36.5083 49.1357 39.5281 32.2832 14.3442 13.8920 14.0299 11.0555 13.9480 10.1673 7.3914 19.2604 13.8411 0.1242
temp: 298.150 k
press: 1.00000 atm
elementType: 17 17 17 7 7 7 7 7 6 6 6 6 6 6 6 6 6 6 6 1 1 1 1 1 1 1 1 1 1 1 1 1 1
symmnumber: 1
zpe: 648820.6 jmol-1
zpe.correction: 0.247123 hartree
zpe.thermalcorrener: 0.267059 hartree
zpe.thermalcorrenthalpy: 0.268004 hartree
zpe.thermalcorrgfe: 0.192342 hartree
zpe.sumelectzpe: -2080.068397 hartree
zpe.sumelectthermal: -2080.048461 hartree
zpe.sumelectthermalent: -2080.047517 hartree
zpe.sumelectthermalfe: -2080.123178 hartree
dipole: 6.0162 2.3484 1.2532
dipole: 6.5788
quadrupole: -116.9047 -156.7082 -132.8654
quadrupole: 2.4671 -7.1614 -0.1562
quadrupole: 18.5880 -21.2154 2.6274 2.4671 -7.1614 -0.1562
hfenergy: -2080.3155201 hartree
pointgroup: C01 [X(C11H14Cl3N5)]
dipole: 2.2174722 0.3936878 -1.2755778 debye
polarizability: 216.7700874|-14.1040056|120.8659201|-25.4495976|4.1624995|224.9859475 unknown
InChI: InChI=1S/C11H14Cl3N5/c1-18-7-15-9-8(16-11(14)17-10(9)18)6-19(4-2-12)5-3-13/h7H,2-6H2,1H3
charge 0 multiplicity 1
33 atoms
Cl -1.619102 -2.117523 -3.398006
Cl -4.80442 -0.357988 2.503898
Cl 1.058398 -0.011121 4.036118
N  -2.27938 0.873635 -0.57189
N  3.161933 -0.051783 -0.675899
N  0.018753 0.938104 1.741025
N  1.406577 0.980305 -1.76032
N  2.244284 -0.077211 1.622887
C  -1.256778 1.858151 -0.193001
C  -2.175922 0.181793 -1.861876
C  -3.46622 0.700203 0.272417
C  -0.006923 1.215522 0.396768
C  1.113464 0.850728 -0.386808
C  2.200044 0.20771 0.296398
C  -1.739461 -1.287384 -1.693908
C  -3.202006 -0.200581 1.496523
C  2.627498 0.432091 -1.884633
C  4.458766 -0.706505 -0.456579
C  1.113641 0.321807 2.254542
H  -1.683369 2.539342 0.565453
H  -0.96009 2.455349 -1.077062
H  -1.429282 0.700696 -2.489904
H  -3.146338 0.20905 -2.398109
H  -4.275287 0.255416 -0.337291
H  -3.832213 1.683788 0.632192
H  -0.73786 -1.373203 -1.248079
H  -2.47278 -1.887923 -1.134573
H  -2.928491 -1.22801 1.211585
H  -2.453349 0.225258 2.18021
H  3.17619 0.351972 -2.821404
H  4.309853 -1.71803 -0.044082
H  4.993122 -0.780154 -1.41663
H  5.065449 -0.123005 0.255436
