program: Gaussian 09
title: 000165762
version: EM64L-G09RevD.01
frameworkgroup: C1[X(C6H12O2)]
method: RPBEPBE
basis: SDD
operation: Freq
keyword: #pfreq=noraman
keyword: PBEPBE/SDD
title: #p freq=noraman PBEPBE/SDD
converged: YES YES NO NO
title: Mulliken charges:
elementType: O O C C C C C C H H H H H H H H H H H H
charge: -0.270312 -0.448564 -0.390625 -0.237838 -0.314671 -0.305455 -0.055201 -0.561968 0.231177 0.233779 0.178837 0.176509 0.183343 0.183383 0.196846 0.188968 0.234691 0.341317 0.219938 0.215847
chargesum: 0.00000
title: Mulliken charges with hydrogens summed into heavy atoms:
elementType: O O C C C C C C
charge: -0.270312 -0.107247 0.074331 0.117507 0.052055 0.080359 0.179489 -0.126183
polarizability: 1.05532853e+02 -3.38497957e+00 5.93952433e+01 -7.76557604e+00 -2.80155589e+00 5.64244763e+01
1716.lowfreq: -7.6982 0.0009 0.0010 0.0010 1.9847 14.6783 42.3485 52.0960 80.7282
frequency: 42.2868 52.0654 80.6926 98.9033 119.3969 136.7977 222.6321 284.0618 287.4307 373.5068 458.1662 486.3702 628.3898 798.0542 883.9817 896.6621 932.9365 948.0569 972.4596 979.9454 1009.6006 1028.0273 1053.0777 1084.3343 1127.0060 1149.9397 1177.1078 1209.2510 1219.3648 1265.3768 1274.8263 1279.2137 1295.6930 1334.2485 1399.0590 1419.8378 1435.0836 1466.0684 1474.9319 1483.9522 1495.7279 1665.3795 2892.5837 2902.2194 2924.7764 2943.5579 2961.5660 2970.0775 3022.9833 3089.4302 3089.9845 3120.2528 3199.7746 3565.7532
redmass: 3.7622 2.0609 3.5682 2.8924 2.2819 3.0819 3.0100 1.0870 5.0077 2.7001 2.7786 3.0653 1.5995 1.0733 1.1864 2.6669 2.2272 1.3443 1.7294 4.7625 1.2446 2.4211 7.6704 2.7076 1.5144 1.6289 1.1889 1.2237 1.2771 1.1747 1.1192 1.2420 1.2652 1.2891 1.3638 1.4670 1.2422 1.0943 1.0769 1.0781 1.0847 4.8344 1.0583 1.0562 1.0545 1.1057 1.0988 1.1068 1.0595 1.1040 1.0611 1.0944 1.1142 1.0665
irintensity: 2.2846 5.2899 0.5549 0.7235 0.3087 6.5628 0.4769 161.8854 1.8377 15.3906 1.8393 18.4323 7.6998 3.6370 0.2752 10.1812 3.6565 102.6783 15.5221 120.2277 23.0684 3.3832 108.0533 15.1553 2.7126 3.3207 1.1089 4.0714 35.9484 0.0612 0.9749 0.1414 5.4842 47.3351 9.6800 12.0036 12.6620 6.1053 2.7240 3.0203 4.0205 4.3809 25.7582 90.5325 106.8514 55.9972 49.7687 81.3528 18.1756 35.8481 15.5489 8.0727 28.2290 2.5550
temp: 298.150 k
press: 1.00000 atm
elementType: 8 8 6 6 6 6 6 6 1 1 1 1 1 1 1 1 1 1 1 1
symmnumber: 1
zpe: 446882.2 jmol-1
zpe.correction: 0.170208 hartree
zpe.thermalcorrener: 0.180657 hartree
zpe.thermalcorrenthalpy: 0.181601 hartree
zpe.thermalcorrgfe: 0.133142 hartree
zpe.sumelectzpe: -385.555551 hartree
zpe.sumelectthermal: -385.545102 hartree
zpe.sumelectthermalent: -385.544158 hartree
zpe.sumelectthermalfe: -385.592617 hartree
dipole: -0.4368 3.4450 0.2135
dipole: 3.4792
quadrupole: -40.8937 -51.0079 -49.4827
quadrupole: -7.0355 -0.3606 -1.6232
quadrupole: 6.2344 -3.8798 -2.3546 -7.0355 -0.3606 -1.6232
hfenergy: -385.7257594 hartree
pointgroup: C01 [X(C6H12O2)]
dipole: -0.1671943 -1.3288184 0.2827034 debye
dipolederiv: -1.2556941 -0.0385064 0.0066522 -0.0002666 -0.3961998 -0.0210862 0.0688793 -0.0056057 -0.4073556 -0.6933579 0.3100939 -0.0815986 0.3571398 -0.3731196 -0.0629123 -0.0864622 -0.0638782 -0.5736112 -0.1982368 -0.0041309 0.0027727 -0.0467244 0.0340479 0.0112014 0.0210436 0.0170576 0.0945393 0.751699 0.1170644 -0.0277552 0.2572318 0.3564127 0.0337174 -0.0843735 0.0333481 0.4563358 0.653393 -0.218747 0.0542431 -0.1420083 0.3867276 0.0242545 0.0286539 0.024753 0.4501127 0.8127123 -0.0988815 0.0497801 -0.3515993 0.3364154 0.0908195 -0.0028573 0.0565239 0.3949765 0.0056329 0.1207046 0.0691576 0.1777984 -0.0495053 -0.1295727 0.0262412 -0.1303091 0.0556762 -0.213634 0.1037972 0.0086513 0.1212594 -0.214905 -0.2052844 0.0411068 -0.2129814 -0.0427477 0.0829324 -0.0005231 0.0137419 -0.00409 0.0474671 0.0747195 0.0024429 0.0816177 -0.094187 0.0812579 -0.012995 -0.0133321 -0.010199 -0.0470361 -0.0963941 -0.0056343 -0.1046549 0.0037596 -0.0423303 -0.0013574 0.0155186 -0.082169 -0.1550428 -0.1175491 -0.0080525 -0.1541605 -0.0626484 -0.0418984 -0.0041994 -0.0188044 -0.0642292 -0.0222987 0.0918978 0.049951 0.1312702 -0.1915686 -0.0162164 0.0238796 -0.0187006 0.0254731 -0.1757549 -0.1164421 -0.0238876 -0.1572441 -0.0573939 -0.0157143 0.0365109 -0.0023653 0.0377606 -0.0356485 0.1021817 0.0027965 0.1429311 -0.1968491 -0.0481187 0.0174201 -0.0130141 0.0688327 0.0115561 0.0688585 -0.0467531 0.1160004 -0.1696942 -0.0953183 -0.0679388 -0.050109 0.0565296 -0.1356081 -0.1189524 0.014702 -0.1456817 -0.0357425 0.0960185 -0.0112883 -0.0430458 -0.0772849 0.0674627 0.1009585 -0.0231224 0.1122657 -0.0418369 0.0689051 -0.1114832 0.0364836 -0.1616537 0.1816304 0.058143 0.0490851 0.0574386 0.3809725 -0.036195 -0.1213784 0.022935 -0.141004 0.0870804 0.0744346 0.0213318 0.079732 0.0867855 0.104163 -0.0380413 -0.0112111 -0.020797 0.0963185 0.1370071 -0.0450914 0.121577 -0.049523 unknown
polarizability: 105.3418446|5.6465861|57.7866576|7.0354072|-3.075331|58.2240708 unknown
InChI: InChI=1S/C6H12O2/c1-2-5-8-6-3-4-7/h2,7H,1,3-6H2
charge 0 multiplicity 1
20 atoms
O  0.622153 0.183291 -0.11189
O  -4.183095 0.573113 -0.077222
C  -1.789591 0.307259 -0.072291
C  -0.583814 -0.617457 0.126453
C  -3.119843 -0.42065 0.145701
C  1.854877 -0.60687 0.042551
C  3.018733 0.267312 -0.347302
C  4.158766 0.394762 0.374534
H  -1.766294 0.723491 -1.095338
H  -1.719141 1.15646 0.630561
H  -0.616583 -1.475729 -0.585414
H  -0.567525 -1.033531 1.160761
H  -3.216476 -1.268689 -0.568487
H  -3.171323 -0.828161 1.180008
H  1.960735 -0.970571 1.088337
H  1.801407 -1.498729 -0.626722
H  2.89615 0.804892 -1.297569
H  -5.06665 0.145696 0.054453
H  4.989342 1.01901 0.027502
H  4.29517 -0.119797 1.334073
