program: Gaussian 09
title: 000165619
version: EM64L-G09RevD.01
frameworkgroup: C1[X(C10H14NO4P)]
method: RPBEPBE
basis: SDD
operation: Freq
keyword: #p
keyword: freq=noraman
keyword: PBEPBE/SDD
title: #p freq=noraman PBEPBE/SDD
converged: YES YES NO NO
title: Mulliken charges:
elementType: P O O O O N C C C C C C C C C C H H H H H H H H H H H H H H
charge: 1.134826 -0.534047 -0.643896 -0.217055 -0.220436 0.020646 -0.645552 -0.643143 -0.636239 -0.640052 0.362489 -0.321248 -0.353282 -0.342203 -0.333435 0.378339 0.253821 0.264087 0.278579 0.250846 0.226837 0.242369 0.253039 0.235855 0.216819 0.258908 0.318140 0.260726 0.286655 0.287608
chargesum: 0.00000
title: Mulliken charges with hydrogens summed into heavy atoms:
elementType: P O O O O N C C C C C C C C C C
charge: 1.134826 -0.534047 -0.643896 -0.217055 -0.220436 0.020646 -0.127643 -0.113718 0.086005 0.071529 0.362489 -0.003108 -0.092556 -0.055547 -0.045827 0.378339
polarizability: 2.42409104e+02 6.30822815e+00 1.18678884e+02 1.56059822e+00 1.75753456e+01 1.34851120e+02
1716.lowfreq: -9.4500 -2.3923 -0.0013 0.0016 0.0024 6.3010 14.2222 29.6998 45.4569
frequency: 13.2790 29.1051 45.3854 51.0119 72.4396 88.8067 99.7260 126.2489 158.0646 167.6594 192.2604 200.9710 232.7704 250.6910 267.7524 282.8398 312.4606 352.6895 413.7188 416.8475 449.1271 492.5987 504.0524 548.9202 598.6646 624.5671 659.5335 667.5946 679.4953 734.9727 760.9608 764.2479 775.5642 834.2320 838.0625 871.8004 968.4235 982.9853 985.1111 996.4181 998.1348 1004.9682 1025.2749 1037.5698 1051.8421 1074.5416 1094.7225 1108.1115 1170.0653 1218.6412 1225.6264 1236.2628 1245.3160 1269.0384 1269.7906 1293.9981 1353.1804 1393.3951 1400.6888 1400.9786 1423.6465 1428.2536 1431.7695 1473.3269 1474.9925 1478.3076 1482.3356 1484.9769 1585.8053 1603.4579 2991.8109 2998.0768 3012.9643 3017.9086 3075.9212 3080.7879 3091.1020 3096.0604 3102.6041 3107.9096 3155.6811 3166.9827 3182.7110 3188.4464
redmass: 4.7172 4.6915 2.5989 2.5890 7.0380 5.9188 4.4838 2.3920 3.5706 1.6953 9.1397 1.5474 1.9365 3.3510 2.8685 4.5421 6.7816 5.5535 4.6601 3.0562 6.8130 3.5252 6.7371 6.4617 4.1431 7.4346 8.7464 4.8818 3.8676 4.9101 1.3455 1.3161 6.6541 5.5271 1.3487 1.5534 2.2742 1.3295 1.4480 1.5474 2.2646 1.7914 1.5892 2.5012 1.9783 2.0145 3.1677 1.2712 1.4317 3.3958 6.0740 1.2335 1.2186 1.3454 1.3333 1.2892 7.6964 9.2815 1.1805 1.1830 1.0819 1.0981 3.8725 1.0668 2.1784 1.0541 1.0470 1.0468 7.9623 6.3825 1.0358 1.0353 1.0590 1.0589 1.1017 1.1021 1.1010 1.1003 1.1018 1.1018 1.0924 1.0890 1.0950 1.0971
irintensity: 0.7170 0.4980 0.2021 0.8799 0.0094 2.0711 2.1622 1.0216 5.1641 0.8251 4.7923 13.2833 4.7588 11.5887 8.0392 3.6601 2.8210 14.7307 12.1361 0.0784 43.4098 25.9792 9.1337 10.2914 16.5264 23.9449 133.6838 15.5316 50.6663 5.2964 27.8728 48.4561 31.9629 190.7781 17.9752 80.5202 39.5449 1.1555 7.7036 0.1647 4.9475 18.9992 14.8372 17.6712 59.0836 21.7684 22.6794 27.1309 266.6428 509.5939 194.9168 0.3253 5.4574 0.1837 2.1293 0.2560 84.4044 37.9112 16.1580 13.1339 10.0156 12.7998 16.7123 9.6980 119.4555 28.0306 11.8357 13.6347 34.1873 247.0683 27.5480 23.6376 9.9918 7.0520 4.5323 0.9661 17.2632 20.4651 19.2223 20.9779 4.9714 1.6948 0.6138 3.0720
temp: 298.150 k
press: 1.00000 atm
elementType: 15 8 8 8 8 7 6 6 6 6 6 6 6 6 6 6 1 1 1 1 1 1 1 1 1 1 1 1 1 1
symmnumber: 1
zpe: 601243.4 jmol-1
zpe.correction: 0.229002 hartree
zpe.thermalcorrener: 0.246655 hartree
zpe.thermalcorrenthalpy: 0.247599 hartree
zpe.thermalcorrgfe: 0.180554 hartree
zpe.sumelectzpe: -1085.042621 hartree
zpe.sumelectthermal: -1085.024967 hartree
zpe.sumelectthermalent: -1085.024023 hartree
zpe.sumelectthermalfe: -1085.091068 hartree
dipole: -8.6653 -0.5353 -3.7575
dipole: 9.4600
quadrupole: -122.2549 -97.4030 -104.7442
quadrupole: -2.1879 5.5613 -2.8477
quadrupole: -14.1209 10.7311 3.3898 -2.1879 5.5613 -2.8477
hfenergy: -1085.2716222 hartree
pointgroup: C01 [X(C10H14N1O4P1)]
dipole: 3.3733659 -0.3028699 1.5430318 debye
polarizability: 242.5156183|-0.9256749|124.3051359|5.2519525|-19.2340682|129.1183538 unknown
InChI: InChI=1S/C10H14NO4P/c1-3-16(14,4-2)15-10-7-5-9(6-8-10)11(12)13/h5-8H,3-4H2,1-2H3
charge 0 multiplicity 1
30 atoms
P  2.754127 0.278162 -0.03209
O  1.375723 -0.748768 0.513891
O  2.594838 0.952509 -1.477609
O  -4.561646 0.846441 -1.262544
O  -4.981611 -0.522608 0.515014
N  -4.172128 0.079784 -0.295907
C  4.07495 -1.044906 0.106921
C  2.869898 1.505543 1.389766
C  4.047519 -1.992571 -1.108702
C  3.965052 2.564973 1.143582
C  0.024613 -0.487463 0.26294
C  -0.433031 0.337167 -0.802197
C  -0.89608 -1.132998 1.130741
C  -1.815821 0.522854 -0.978597
C  -2.275546 -0.951745 0.947524
C  -2.723076 -0.118568 -0.105088
H  5.045008 -0.51907 0.181871
H  3.894277 -1.5831 1.053638
H  1.873565 1.975961 1.471456
H  3.044478 0.923901 2.312254
H  4.883566 -2.710834 -1.044075
H  3.104482 -2.564416 -1.14531
H  4.144041 -1.428742 -2.052503
H  3.940098 3.321353 1.947416
H  4.977329 2.121795 1.132532
H  3.804295 3.07952 0.180435
H  0.28795 0.805951 -1.478882
H  -0.508185 -1.766762 1.933075
H  -2.203711 1.149165 -1.786312
H  -3.008775 -1.433628 1.59926
