program: Gaussian 09
title: 000165602
version: EM64L-G09RevD.01
frameworkgroup: C1[X(C11H15Cl2O4P)]
method: RPBEPBE
basis: SDD
operation: Freq
keyword: #p
keyword: freq=noraman
keyword: PBEPBE/SDD
title: #p freq=noraman PBEPBE/SDD
converged: YES YES NO NO
title: Mulliken charges:
elementType: Cl Cl P O O O O C C C C C C C C C C C H H H H H H H H H H H H H H H
charge: -0.045419 -0.058707 1.387809 -0.533720 -0.490320 -0.551696 -0.587934 -0.221438 -0.367644 -0.674916 -0.185819 0.373544 -0.313018 -0.353922 -0.562666 -0.185381 -0.181328 -0.112529 0.226873 0.228588 0.222368 0.217062 0.213727 0.230279 0.215694 0.251742 0.240602 0.300132 0.257092 0.287041 0.257358 0.257952 0.258596
chargesum: 0.00000
title: Mulliken charges with hydrogens summed into heavy atoms:
elementType: Cl Cl P O O O O C C C C C C C C C C C
charge: -0.045419 -0.058707 1.387809 -0.533720 -0.490320 -0.551696 -0.587934 0.234023 0.071785 -0.015216 0.306525 0.373544 -0.012887 -0.096830 -0.018266 0.072571 0.077268 -0.112529
polarizability: 2.45158738e+02 -7.75992670e+00 1.40815219e+02 -2.00243656e+00 -1.31966979e+01 1.41223795e+02
1716.lowfreq: -4.9261 -3.1757 -0.0018 -0.0018 0.0006 7.3425 14.4170 16.7460 21.3877
frequency: 14.0822 16.4898 21.2318 31.0700 35.7789 44.7039 64.6006 86.2323 95.7727 119.0666 133.6516 143.6181 194.6824 211.8970 223.6435 227.5557 245.7878 263.7013 293.6733 314.3956 339.4778 366.4144 379.1379 396.2284 414.1161 456.5261 473.8214 498.0776 556.2993 607.8490 623.3078 648.1912 696.4548 699.4116 727.6424 764.5870 815.6362 828.6915 833.4596 863.9779 886.8788 894.7096 941.6666 945.9640 949.3018 962.9578 979.5539 995.0984 1048.2480 1062.0182 1071.2831 1080.8695 1105.3636 1130.9426 1139.1658 1164.4009 1170.2478 1186.8567 1222.8280 1226.5370 1281.8136 1288.7328 1298.6786 1304.4533 1366.0334 1367.9527 1369.9905 1397.4592 1397.8818 1427.8842 1450.1804 1466.6959 1473.1853 1480.2312 1481.2073 1489.9147 1586.7086 1596.0291 2982.9328 2990.7465 3000.3320 3007.2114 3046.5228 3059.2241 3066.4360 3075.6381 3087.0127 3088.8204 3146.3436 3156.4014 3164.6017 3175.4434 3184.4560
redmass: 6.7078 8.0779 6.0008 4.1579 2.5952 2.3984 5.2903 9.3991 4.4152 3.8069 5.1556 7.7721 4.7730 8.9306 1.1607 2.6964 6.2534 5.8256 6.4553 4.1353 7.0055 5.0947 9.5721 4.3554 3.0279 7.4185 5.4664 3.1903 7.9675 5.2000 7.3635 6.4090 4.3404 5.9789 8.0735 1.0753 1.2826 6.9825 1.4877 2.6124 1.1486 1.9987 2.4061 1.4103 4.0860 1.3432 2.0056 4.3485 2.9079 6.3572 3.0034 2.5797 1.3319 2.2034 1.4158 1.9716 1.1697 1.7068 1.1504 1.2738 1.1071 1.2521 1.1976 1.3187 1.4341 3.0452 1.6382 1.2924 2.8350 1.1007 1.0783 2.2946 1.0669 1.0727 1.0419 1.0825 6.9740 7.2260 1.0361 1.0562 1.0578 1.0593 1.1033 1.0629 1.1053 1.1011 1.0991 1.1048 1.1093 1.0903 1.0887 1.0968 1.0978
irintensity: 0.1290 1.0651 1.6202 0.5971 0.7137 2.7112 1.6472 1.0532 1.3492 2.5878 0.5055 1.2191 3.0100 3.7770 0.2780 7.1863 6.1205 15.1365 4.7915 1.1127 1.1089 27.1493 54.8007 12.2377 0.0331 17.4851 13.7954 33.7938 13.6576 23.0598 12.2454 13.2419 60.2550 146.1403 170.8631 7.0511 8.0070 171.8768 68.8269 121.8297 1.7206 64.2277 176.7029 31.4241 180.1751 3.2061 77.9080 46.9541 6.1617 104.7372 100.2743 17.0572 5.3174 4.4180 0.5098 133.2463 3.5674 85.5153 1.3432 0.2451 0.0655 0.2833 16.3810 0.7262 4.1266 4.1911 4.6146 13.4483 4.2496 14.3880 18.0882 229.6604 3.3079 0.3143 14.0887 19.9198 10.4343 2.4915 28.0559 24.2226 23.4977 31.7022 1.7089 12.5362 0.0478 15.4566 39.0559 77.0289 6.1196 1.7102 2.6718 2.4156 2.0487
temp: 298.150 k
press: 1.00000 atm
elementType: 17 17 15 8 8 8 8 6 6 6 6 6 6 6 6 6 6 6 1 1 1 1 1 1 1 1 1 1 1 1 1 1 1
symmnumber: 1
zpe: 644147.1 jmol-1
zpe.correction: 0.245343 hartree
zpe.thermalcorrener: 0.266228 hartree
zpe.thermalcorrenthalpy: 0.267172 hartree
zpe.thermalcorrgfe: 0.189795 hartree
zpe.sumelectzpe: -1989.007842 hartree
zpe.sumelectthermal: -1988.986957 hartree
zpe.sumelectthermalent: -1988.986013 hartree
zpe.sumelectthermalfe: -1989.063390 hartree
dipole: -5.0720 0.4347 -3.3839
dipole: 6.1126
quadrupole: -124.4120 -119.2495 -130.7347
quadrupole: -1.3335 5.8959 -1.6128
quadrupole: 0.3868 5.5492 -5.9360 -1.3335 5.8959 -1.6128
hfenergy: -1989.253185 hartree
pointgroup: C01 [X(C11H15Cl2O4P1)]
dipole: 1.9824894 0.0138068 1.3612735 debye
polarizability: 241.4682155|21.3042344|137.0008733|0.9327525|11.108929|148.7286639 unknown
InChI: InChI=1S/C11H15Cl2O4P/c1-2-8-15-18(14,16-9-7-12)17-11-5-3-10(13)4-6-11/h3-6H,2,7-9H2,1H3
charge 0 multiplicity 1
33 atoms
Cl -1.431606 3.319233 1.562328
Cl -5.573937 -1.934813 -0.346717
P  1.223243 0.542462 -0.771072
O  2.731878 0.249808 -0.012606
O  0.973555 2.182999 -0.354432
O  0.221962 -0.393625 0.318395
O  1.058149 0.245967 -2.315797
C  3.376379 -1.094722 -0.159924
C  4.782412 -0.961816 0.424842
C  5.549125 -2.302162 0.350763
C  1.253138 2.661756 1.02466
C  -1.149857 -0.707313 0.082681
C  -1.676618 -0.940032 -1.208162
C  -1.947261 -0.839008 1.239429
C  0.350757 3.854329 1.27755
C  -3.034896 -1.308591 -1.335146
C  -3.29988 -1.220042 1.110243
C  -3.823816 -1.447091 -0.177623
H  3.403965 -1.365261 -1.232824
H  2.770342 -1.835916 0.39452
H  5.327815 -0.175803 -0.128848
H  4.702155 -0.625867 1.475352
H  5.029795 -3.096754 0.918024
H  6.561739 -2.192183 0.776767
H  5.65985 -2.647087 -0.693974
H  1.085666 1.857429 1.763244
H  2.31361 2.976546 1.061325
H  -1.047193 -0.829856 -2.096622
H  -1.509279 -0.645485 2.222223
H  0.330274 4.532591 0.412536
H  0.656508 4.390146 2.189742
H  -3.464268 -1.488367 -2.324793
H  -3.932503 -1.328173 1.995516
