program: Gaussian 09
title: 000165587
version: EM64L-G09RevD.01
frameworkgroup: C1[X(C9H9Cl2NO3)]
method: RPBEPBE
basis: SDD
operation: Freq
keyword: #p
keyword: freq=noraman
keyword: PBEPBE/SDD
title: #p freq=noraman PBEPBE/SDD
converged: YES YES NO NO
title: Mulliken charges:
elementType: Cl Cl O O O N C C C C C C C C C H H H H H H H H H
charge: -0.022240 -0.013037 -0.435658 -0.455011 -0.219372 -0.654434 -0.191703 -0.212606 0.401307 -0.409125 -0.389119 0.187301 -0.061198 -0.194575 -0.108550 0.253338 0.280377 0.296547 0.306212 0.320719 0.292053 0.256735 0.372992 0.399045
chargesum: 0.00000
title: Mulliken charges with hydrogens summed into heavy atoms:
elementType: Cl Cl O O O N C C C C C C C C C
charge: -0.022240 -0.013037 -0.062666 -0.055965 -0.219372 -0.041662 0.061636 0.067771 0.401307 -0.112578 -0.082907 0.187301 -0.061198 0.062160 -0.108550
polarizability: 1.67103768e+02 -4.59656910e+00 1.34937618e+02 -1.91357377e+01 2.51221091e+00 8.66542405e+01
1716.lowfreq: -7.0489 -5.9659 -1.8302 -0.0015 0.0013 0.0025 15.2057 43.0881 71.5762
frequency: 14.4941 43.0642 71.5753 96.2610 130.2771 159.1241 173.3837 186.8267 204.8752 237.1374 284.0485 293.7618 298.9407 366.3656 383.1841 420.8465 440.9400 461.4291 463.1526 513.5442 534.1823 550.1603 570.8263 599.5585 623.0437 647.7185 664.7533 693.8771 732.3387 794.7426 834.6423 867.7004 926.7668 976.2592 993.1951 994.9473 1006.2132 1049.5899 1116.0714 1121.8016 1139.3127 1163.0790 1196.5673 1209.5831 1216.9314 1249.0685 1268.2881 1325.0407 1359.4000 1376.6196 1378.7373 1384.0136 1454.0068 1563.5558 1593.2382 1614.2292 1679.9298 2918.5608 3036.4013 3154.1148 3170.8723 3173.3522 3473.7081 3486.2633 3523.0483 3628.7841
redmass: 7.8393 9.6671 9.8515 7.2295 6.7441 5.5469 8.1075 11.5209 3.1363 1.6092 6.2620 8.7464 3.9369 6.7931 4.6421 9.6867 3.3868 3.3983 4.2801 5.3508 1.1850 3.2809 1.4981 2.5228 1.7840 5.0475 6.7340 4.5322 3.3782 6.0907 1.5326 2.2934 1.5090 4.7728 4.6631 1.3649 4.6453 2.9274 1.9034 1.5549 1.5328 1.5956 2.2581 1.4145 1.5365 1.3511 1.5304 1.4990 3.0226 1.9741 2.1180 1.7977 2.6971 8.5194 6.6929 1.2772 4.2200 1.0812 1.0851 1.0891 1.0938 1.0944 1.0652 1.0468 1.0644 1.0985
irintensity: 0.0499 0.4283 1.8948 0.5212 0.1167 2.2206 1.2424 1.8466 5.5309 15.6763 3.0306 1.1961 2.9666 2.9634 5.2028 2.1358 24.2685 29.7444 16.6311 41.0045 56.1013 80.7475 41.5697 95.4268 367.8045 13.3495 9.9381 9.5323 0.3092 15.5349 37.4468 1.7097 13.4252 40.2566 41.4598 5.3747 22.4127 262.4711 26.7131 7.2850 1.2376 17.2445 10.7232 29.9368 12.4277 0.8381 2.5482 36.4837 1.1276 16.2041 56.0732 13.8743 85.6508 11.2750 10.1169 166.1676 126.2207 33.0339 16.1051 3.2421 0.6229 7.4520 49.8553 16.6588 34.6968 23.2013
temp: 298.150 k
press: 1.00000 atm
elementType: 17 17 8 8 8 7 6 6 6 6 6 6 6 6 6 1 1 1 1 1 1 1 1 1
symmnumber: 1
zpe: 444283.1 jmol-1
zpe.correction: 0.169218 hartree
zpe.thermalcorrener: 0.184153 hartree
zpe.thermalcorrenthalpy: 0.185097 hartree
zpe.thermalcorrgfe: 0.125455 hartree
zpe.sumelectzpe: -1547.779588 hartree
zpe.sumelectthermal: -1547.764653 hartree
zpe.sumelectthermalent: -1547.763709 hartree
zpe.sumelectthermalfe: -1547.823351 hartree
dipole: 4.6197 -0.7775 0.3791
dipole: 4.7000
quadrupole: -99.1529 -102.0494 -97.7176
quadrupole: -0.9089 -2.1270 10.3039
quadrupole: 0.4871 -2.4094 1.9223 -0.9089 -2.1270 10.3039
hfenergy: -1547.9488064 hartree
pointgroup: C01 [X(C9H9Cl2N1O3)]
dipole: 1.7284472 0.4336712 -0.4935402 debye
dipolederiv: -0.295112 -0.2541776 0.1431879 -0.3138346 -0.4241688 0.2294969 0.1689716 0.2210595 -0.1811047 -0.7234997 -0.0589599 -0.2108021 -0.0662405 -0.0602561 -0.0047935 -0.2482884 -0.005835 -0.1281311 -0.8030505 0.0309674 -0.0555446 0.0790424 -0.4637727 0.253011 -0.0307454 0.1927435 -0.5104485 -0.4778058 0.0353428 0.0480038 0.0758292 -1.0417884 0.302634 0.0755894 0.229142 -0.4252925 -0.2864018 -0.0317954 -0.0295327 0.0312229 -0.539155 -0.0458969 0.1747686 0.1690699 -0.9607159 -0.7735178 0.0481552 0.1454944 0.0515898 -0.628459 0.175749 0.1619731 0.1119698 -0.3633099 0.525192 -0.1123175 0.0280724 -0.1824684 0.3333821 -0.2165515 0.1044621 0.0047675 0.4318009 0.3136539 0.0376674 -0.0451078 0.0811971 0.3445501 -0.2362476 -0.1064577 -0.3690009 -0.0877808 0.1127724 0.0557116 -0.0007752 0.1247149 -0.0215386 -0.0003774 0.1314041 0.0072819 -0.0999183 -0.248369 -0.1149571 0.1037829 -0.0753034 -0.1893848 0.0586996 -0.018457 0.0011316 -0.073988 -0.1819695 0.0405825 0.0016515 0.0206961 -0.0569043 -0.0624688 0.007008 -0.0543147 -0.0797904 0.2339922 0.0826105 0.0736958 -0.1034004 1.1946412 -0.0835644 -0.2302371 -0.2060539 1.2711082 0.2225262 0.4642851 -0.3212432 0.4160139 0.5851052 -0.3986177 -0.2661745 -0.3404202 0.1700189 -0.1915183 0.0152016 -0.0463827 -0.0651641 -0.0294946 -0.0691483 -0.0028303 -0.0563729 -0.0441611 0.9197906 -0.0198717 0.4328408 0.0738534 -0.105008 0.0774234 0.377401 0.0352244 0.0668285 -0.0396866 -0.0185641 -0.025327 -0.0170133 -0.0580733 -0.0416088 -0.0504259 -0.0761216 -0.009533 -0.1336256 0.0412719 -0.0626418 0.0535709 -0.0103101 0.0271269 -0.0518219 0.0591197 0.0295043 0.1527646 0.0216234 -0.0413624 0.0065943 0.0888963 0.0527468 -0.0153965 0.061145 0.0950014 0.1811941 -0.0421653 -0.0004351 -0.0251048 0.0791511 0.0429837 0.0042481 0.0514101 0.0965273 0.3151439 -0.027602 0.0342712 -0.0332281 0.2439883 -0.0262591 0.0092711 0.0404739 0.1394394 0.2724427 -0.1214573 -0.0708215 -0.0521471 0.1791915 -0.0009555 -0.0791055 -0.0051724 0.159626 0.0587053 0.0158749 -0.0479016 0.0132226 0.0657727 0.0843731 -0.0639429 0.0850583 0.0618211 0.436576 -0.0357722 -0.0231738 -0.0401336 0.2050157 -0.0860445 -0.0463143 -0.0739627 0.3074575 0.4098027 -0.0516544 -0.0299492 -0.0535093 0.3086193 -0.0317106 -0.0049 -0.0823427 0.1350408 unknown
polarizability: 160.8320799|24.3624157|119.0022256|8.9853256|-24.4971231|108.861321 unknown
InChI: InChI=1S/C9H9Cl2NO3/c10-5-2-1-4(3-6(5)11)8(13)7(12)9(14)15/h1-3,7-8,13-14H,12H2
charge 0 multiplicity 1
24 atoms
Cl -3.078462 -2.062619 1.544017
Cl -4.350055 -0.090558 -0.769821
O  1.890097 -0.401636 2.088295
O  2.357473 -1.524171 -0.431155
O  2.373616 -0.082749 -2.25451
N  2.490477 2.145297 -0.623307
C  1.467076 0.666938 1.18452
C  2.547575 0.843816 0.037356
C  0.028284 0.481336 0.685135
C  -0.771999 -0.545342 1.239908
C  -0.53239 1.337357 -0.2988
C  2.418572 -0.249761 -1.020038
C  -2.098667 -0.727187 0.80171
C  -1.860761 1.152351 -0.732817
C  -2.64674 0.11629 -0.185995
H  1.531527 1.585566 1.794737
H  3.513972 0.658638 0.5617
H  -0.363811 -1.183041 2.028445
H  0.081694 2.140602 -0.715473
H  2.576652 2.109421 -1.643068
H  3.020972 2.892359 -0.175045
H  -2.294915 1.806991 -1.49432
H  2.030126 -1.220406 1.538243
H  2.231988 -2.221392 -1.129617
