program: Gaussian 09
title: 000165573
version: EM64L-G09RevD.01
frameworkgroup: C1[X(C11H18O)]
method: RPBEPBE
basis: SDD
operation: Freq
keyword: #pfreq=noraman
keyword: PBEPBE/SDD
title: #p freq=noraman PBEPBE/SDD
converged: YES YES NO NO
title: Mulliken charges:
elementType: O C C C C C C C C C C C H H H H H H H H H H H H H H H H H H
charge: -0.309721 0.481319 -0.035214 -0.032341 -0.601653 -0.530752 -0.475992 -0.469389 -0.460834 -0.454834 -0.403056 -0.402161 0.215721 0.200133 0.213836 0.221958 0.214277 0.214783 0.209523 0.204935 0.210141 0.210262 0.201861 0.197454 0.197580 0.194831 0.193615 0.200247 0.193567 0.199904
chargesum: 0.00000
title: Mulliken charges with hydrogens summed into heavy atoms:
elementType: O C C C C C C C C C C C
charge: -0.309721 0.481319 0.180506 0.167792 -0.165859 -0.101692 -0.061535 -0.048986 -0.061519 -0.062423 -0.009194 -0.008690
polarizability: 1.32163041e+02 -6.04756161e-01 1.09146669e+02 3.31692811e+00 -7.04897851e-01 9.75721727e+01
1716.lowfreq: -24.4272 -0.0007 0.0004 0.0005 7.0899 24.1892 74.7815 105.6699 165.4084
frequency: 74.5587 105.6326 165.4031 198.7642 232.3218 307.0601 312.8432 317.5552 337.8680 390.2183 397.6054 423.7971 453.4539 480.4008 508.2005 568.3878 698.6722 745.6431 777.6669 810.7671 836.5078 842.2575 867.7280 871.6502 897.6388 920.4548 942.2149 968.8347 975.8387 1001.6411 1039.0643 1051.2527 1056.2409 1079.0940 1085.0317 1096.4624 1114.5101 1126.1638 1138.3373 1141.4099 1171.9308 1185.8883 1223.5902 1246.1835 1254.3071 1264.5552 1279.1755 1286.1217 1299.3136 1318.5587 1326.3510 1330.2060 1334.3436 1339.9930 1341.7524 1348.5549 1352.0504 1395.7054 1456.1354 1457.7527 1462.4277 1464.1345 1466.7050 1470.4541 1474.1603 1487.5944 2920.8245 2935.6003 2954.3764 2956.1400 2965.2581 2965.7270 2966.5468 2973.4550 2984.3308 3014.7396 3017.8466 3026.9841 3028.2182 3037.7925 3040.9899 3050.7875 3053.9538 3151.0162
redmass: 3.7477 2.5460 2.5489 2.2059 3.8618 1.9263 2.5024 3.0219 2.3978 2.9488 2.3380 2.7800 2.7254 2.4260 2.4057 2.2498 3.2281 2.2330 4.8898 1.6223 1.7218 2.4955 2.1678 1.5477 2.0921 1.6259 1.4734 1.9088 1.8232 1.9145 2.0796 1.3086 1.2733 1.7441 1.8532 1.6014 2.2910 1.8810 1.4903 1.5525 1.4666 1.6383 1.4472 1.2675 1.3816 1.3625 1.4885 1.3049 1.3655 1.3882 1.3893 1.4985 1.5674 1.5014 1.5413 1.8122 1.5469 2.2722 1.0901 1.0936 1.0904 1.0909 1.0825 1.1418 1.1206 1.1944 1.0792 1.0821 1.0615 1.0616 1.0616 1.0614 1.0662 1.0619 1.0636 1.0984 1.0993 1.0970 1.0989 1.1027 1.1008 1.0533 1.1007 1.1181
irintensity: 1.7806 0.1359 0.4759 0.1353 3.8495 1.0728 1.1788 3.6603 1.1989 0.7886 1.0608 1.4530 4.2162 0.4725 5.5828 9.4638 5.7089 0.3286 27.6708 1.6860 4.4350 9.3614 6.6351 2.2570 3.1244 2.8278 4.9613 2.7470 8.9276 2.3347 2.7255 0.9205 0.4728 0.7656 0.3368 1.6631 0.1906 5.5512 7.9359 2.8941 3.4340 2.0350 1.1720 1.9762 0.0875 1.7909 1.0025 3.4067 0.8047 1.1888 2.8138 2.0628 1.3008 0.7888 1.3386 1.7211 1.8027 14.3542 4.3019 0.5457 12.3449 2.8731 29.8826 9.0909 3.3530 7.4568 0.5821 14.7496 13.8194 31.4115 67.6757 29.6095 35.9401 48.1225 27.1376 44.7163 16.2093 65.0381 71.0729 58.8016 83.6973 33.2469 52.0988 29.5355
temp: 298.150 k
press: 1.00000 atm
elementType: 8 6 6 6 6 6 6 6 6 6 6 6 1 1 1 1 1 1 1 1 1 1 1 1 1 1 1 1 1 1
symmnumber: 1
zpe: 702457.3 jmol-1
zpe.correction: 0.267552 hartree
zpe.thermalcorrener: 0.278398 hartree
zpe.thermalcorrenthalpy: 0.279343 hartree
zpe.thermalcorrgfe: 0.231731 hartree
zpe.sumelectzpe: -504.209705 hartree
zpe.sumelectthermal: -504.198858 hartree
zpe.sumelectthermalent: -504.197914 hartree
zpe.sumelectthermalfe: -504.245526 hartree
dipole: -2.5207 0.8078 1.2730
dipole: 2.9371
quadrupole: -86.3707 -73.2395 -72.0455
quadrupole: 3.6695 5.8865 -1.6165
quadrupole: -9.1521 3.9790 5.1731 3.6695 5.8865 -1.6165
hfenergy: -504.4772564 hartree
pointgroup: C01 [X(C11H18O1)]
dipole: -0.9962967 0.3111769 0.4958706 debye
polarizability: 132.1341948|-0.4582626|109.1409281|3.50116|-0.678028|97.6067599 unknown
InChI: InChI=1S/C11H18O/c1-2-4-10-7-11(8-12-11)6-5-9(10)3-1/h9-10H,1-8H2
charge 0 multiplicity 1
30 atoms
O  3.421829 -0.620836 -0.330121
C  2.00684 -0.126707 -0.074736
C  -0.462043 -0.63267 0.139406
C  -0.775389 0.835417 -0.272787
C  0.894529 -1.094084 -0.455534
C  1.737327 1.321919 -0.461446
C  0.380788 1.782865 0.130652
C  2.909952 -0.439673 1.080019
C  -1.616382 -1.579403 -0.268969
C  -2.13137 1.29351 0.316511
C  -2.971971 -1.116877 0.314281
C  -3.284948 0.345069 -0.085565
H  -0.378395 -0.652861 1.249889
H  -0.861374 0.853311 -1.383737
H  1.142122 -2.116279 -0.112282
H  0.815074 -1.132914 -1.561549
H  1.703243 1.394319 -1.567021
H  2.56381 1.970214 -0.117396
H  0.452069 1.817311 1.237995
H  0.157038 2.813906 -0.206747
H  3.382105 0.380233 1.63777
H  2.769816 -1.373843 1.640449
H  -1.389593 -2.612765 0.061644
H  -1.683373 -1.607236 -1.37741
H  -2.352455 2.327933 -0.014905
H  -2.05179 1.324578 1.424213
H  -2.937919 -1.191779 1.421136
H  -3.783235 -1.78893 -0.026797
H  -3.434507 0.397453 -1.184043
H  -4.2325 0.67572 0.38238
