program: Gaussian 09
title: 000165684
version: EM64L-G09RevD.01
frameworkgroup: C1[X(C22H32O4)]
method: RPBEPBE
basis: SDD
operation: Freq
keyword: #pfreq=noraman
keyword: PBEPBE/SDD
title: #p freq=noraman PBEPBE/SDD
converged: NO YES NO NO
title: Mulliken charges:
elementType: O O O O C C C C C C C C C C C C C C C C C C C C C C H H H H H H H H H H H H H H H H H H H H H H H H H H H H H H H H
charge: -0.439863 -0.290578 -0.204395 -0.228889 0.337514 -0.119998 -0.130426 -0.113598 0.109553 0.246998 -0.537025 -0.522241 -0.561762 -0.549151 -0.500395 0.386702 -0.147360 -0.825974 -0.512225 -0.821573 0.147466 -0.552084 -0.532228 0.178494 -0.823933 -0.513617 0.256377 0.221709 0.221900 0.187361 0.213043 0.231144 0.209988 0.220095 0.230358 0.227622 0.240663 0.265853 0.239639 0.209778 0.258009 0.225642 0.223450 0.208072 0.221494 0.236677 0.218841 0.227906 0.335600 0.228531 0.241608 0.304540 0.267665 0.235051 0.263483 0.199067 0.207809 0.241615
chargesum: 0.00000
title: Mulliken charges with hydrogens summed into heavy atoms:
elementType: O O O O C C C C C C C C C C C C C C C C C C C C C C
charge: -0.104264 -0.290578 -0.204395 -0.228889 0.337514 0.136379 0.091283 0.108301 0.109553 0.246998 -0.136621 -0.081110 -0.111309 -0.080866 0.005097 0.386702 0.062418 -0.118873 -0.082660 -0.138149 0.147466 -0.081944 -0.227688 0.178494 -0.057733 0.134874
polarizability: 2.90089547e+02 -7.15609704e+00 2.39667009e+02 -1.89560094e+01 7.53839481e+00 1.98430916e+02
1716.lowfreq: -10.5252 -7.2599 -2.5014 -0.0007 -0.0006 -0.0004 31.4678 35.8824 52.9925
frequency: 31.3388 35.8563 52.9867 59.0545 62.5493 80.5610 107.9823 124.3244 137.2502 151.5401 154.9475 181.1695 183.5094 196.0419 200.1823 227.4780 229.9778 246.4942 249.6834 260.5431 270.5010 276.4113 281.8578 317.0410 324.9293 335.3669 336.7335 358.1022 371.3115 376.4984 382.8764 403.3016 412.4807 417.0511 437.6617 456.1859 476.4039 495.1703 520.5612 529.7857 539.8255 569.2795 577.4959 597.1838 608.6788 633.6040 651.5830 676.9718 698.7192 733.0049 770.6774 794.6160 810.7649 814.1348 851.9614 858.6928 888.0701 907.3278 909.4582 917.3125 922.1884 931.9215 937.1104 947.5250 966.0731 983.3680 987.1123 991.5375 1001.9061 1012.7670 1021.7567 1025.5325 1036.0256 1037.9077 1053.0364 1057.7071 1063.2557 1073.7055 1107.6469 1108.9528 1111.8282 1118.8762 1123.5154 1133.4923 1145.7174 1150.7571 1153.4324 1176.9466 1179.9270 1184.2656 1206.5051 1208.8602 1216.7060 1229.7371 1239.8579 1250.8380 1257.6447 1270.3490 1272.7845 1274.5408 1277.3265 1288.5193 1299.6565 1305.1539 1312.2872 1318.9758 1322.7921 1327.9011 1332.7746 1335.5237 1344.0677 1352.5501 1362.9642 1364.4313 1370.1454 1390.3630 1404.0964 1436.9426 1445.4588 1446.6804 1452.6976 1458.0920 1458.2228 1461.1083 1462.8003 1467.1273 1473.2122 1475.8451 1477.1476 1481.0754 1486.8497 1491.6785 1493.6637 1587.4622 1619.0974 1627.2381 2921.2285 2932.4930 2934.2612 2941.8456 2946.7322 2967.3449 2973.1556 2978.3214 2980.5832 2981.8616 2984.6476 2989.5754 2993.2807 2996.1549 3012.2697 3013.6581 3030.6698 3041.0839 3046.3891 3049.5263 3058.5726 3062.5535 3066.2077 3073.1346 3077.5718 3082.1790 3097.3303 3101.8414 3105.7540 3123.0215 3161.6249 3547.5808
redmass: 6.5326 4.0507 2.3427 4.0603 4.0529 3.3936 3.6896 3.6907 2.3960 2.3646 2.5954 2.1117 1.8256 1.6305 2.4367 1.4695 1.8837 1.6223 2.1104 2.4341 2.8274 2.8231 2.9334 2.7360 2.5137 2.7647 2.3457 2.1730 2.4598 2.8067 3.5978 3.7026 2.9805 3.1539 3.0065 3.6234 2.9098 3.2523 2.5115 4.4141 3.2081 3.4774 3.2527 3.1518 3.1212 3.5270 3.9590 2.5527 2.8699 3.0392 2.3953 2.0198 2.0152 2.2443 2.3429 2.4345 2.4782 2.6807 2.4989 1.9257 1.7514 1.8220 2.0077 2.0258 2.0143 2.3912 1.7476 2.1181 2.1803 2.2771 2.5465 2.0203 1.9567 2.1349 4.2404 1.9838 2.7281 2.7720 2.0203 1.7501 1.6320 1.9047 2.2852 2.0113 1.5793 1.5974 2.0981 1.8695 1.6950 2.0573 1.9079 1.9742 1.9666 1.5942 1.5008 1.3670 1.6937 1.5145 1.8060 1.4565 1.4560 1.4369 1.3850 1.5114 1.5409 1.4430 1.4751 1.3240 1.4884 1.3090 1.4342 1.4496 1.3259 1.3018 1.6959 1.1949 1.1937 1.1370 1.0820 1.0762 1.0731 1.0639 1.0625 1.0775 1.0812 1.0848 1.0705 1.0705 1.0572 1.0588 1.0587 1.0680 1.0718 10.4281 8.4613 8.1211 1.0802 1.0806 1.0353 1.0641 1.0766 1.0825 1.0673 1.0383 1.0550 1.0461 1.0590 1.0606 1.0568 1.0474 1.0930 1.1013 1.0615 1.1004 1.1026 1.0996 1.0995 1.0952 1.0949 1.0991 1.0975 1.0991 1.1035 1.0990 1.0977 1.0993 1.0907 1.0653
irintensity: 3.0684 2.9394 2.5505 1.5599 3.0255 0.7823 4.7010 1.2134 0.1253 0.8363 0.0736 0.3016 0.1995 4.6740 4.4118 2.3684 0.9801 1.3442 3.8790 2.8719 0.7703 19.2497 6.9616 27.9244 12.2349 14.0667 27.4919 40.7762 39.4825 17.2710 12.5026 21.5815 0.7240 3.7412 9.5791 0.8574 0.3705 3.1403 1.9842 6.1151 4.4573 12.0947 10.1581 3.8092 6.5447 2.7508 0.8304 6.3493 3.6899 6.6925 4.0608 2.5349 0.9565 0.7170 3.0800 9.3834 2.2576 34.9017 19.5369 0.8402 9.6802 3.3563 10.7453 14.2724 9.9245 3.0760 5.2411 4.8298 1.6125 1.1615 3.2366 13.1408 26.7665 15.0837 124.4843 8.8894 4.6407 6.2020 9.1477 3.7673 5.2012 7.2664 15.6589 6.7339 6.3723 21.0654 2.9260 12.2714 10.6286 15.3192 47.9401 18.2381 7.0308 11.4719 18.5743 1.4213 13.5266 43.4262 22.0639 11.0591 9.3560 8.3772 13.9896 16.9952 7.9828 4.3132 5.5182 1.3892 0.5936 2.3515 0.9386 2.7654 27.3013 44.4105 3.9436 18.6896 29.3994 2.8706 14.3335 17.2060 4.5082 18.0048 7.4112 13.0438 0.2675 10.8148 4.4845 18.6362 8.9146 6.7588 21.5889 7.6522 4.6620 193.2766 106.9187 171.7986 27.4442 7.1536 80.1243 35.3494 4.9769 17.5463 11.0081 5.0009 17.9605 10.9787 24.0683 38.9563 27.5879 33.8207 53.1508 73.5966 14.8043 31.6009 26.5261 48.8835 28.7037 9.1936 23.1419 33.4698 33.8965 38.2230 15.3042 14.0819 26.7766 11.8420 0.0996 2.9500
temp: 298.150 k
press: 1.00000 atm
elementType: 8 8 8 8 6 6 6 6 6 6 6 6 6 6 6 6 6 6 6 6 6 6 6 6 6 6 1 1 1 1 1 1 1 1 1 1 1 1 1 1 1 1 1 1 1 1 1 1 1 1 1 1 1 1 1 1 1 1
symmnumber: 1
zpe: 1304055.6 jmol-1
zpe.correction: 0.496689 hartree
zpe.thermalcorrener: 0.522644 hartree
zpe.thermalcorrenthalpy: 0.523588 hartree
zpe.thermalcorrgfe: 0.442745 hartree
zpe.sumelectzpe: -1156.392895 hartree
zpe.sumelectthermal: -1156.366939 hartree
zpe.sumelectthermalent: -1156.365995 hartree
zpe.sumelectthermalfe: -1156.446839 hartree
dipole: -3.2260 -0.0313 3.2425
dipole: 4.5740
quadrupole: -208.1348 -142.3576 -164.3046
quadrupole: 23.5227 21.9139 -2.1770
quadrupole: -36.5358 29.2414 7.2944 23.5227 21.9139 -2.1770
hfenergy: -1156.8895831 hartree
pointgroup: C01 [X(C22H32O4)]
dipole: 1.2508466 -0.1321949 -1.2869593 debye
polarizability: 290.2934056|3.2996779|238.5114795|-20.5934183|-7.7597387|199.3825869 unknown
InChI: InChI=1S/C22H32O4/c1-13(23)22(25)10-7-17-15-12-19(26-4)18-11-14(24)5-8-20(18,2)16(15)6-9-21(17,22)3/h11,15-17,19,25H,5-10,12H2,1-4H3
charge 0 multiplicity 1
58 atoms
O  3.410941 -0.578593 1.962985
O  -3.296858 2.712273 0.206684
O  5.607438 0.083073 -0.812515
O  -5.294579 -1.451542 1.889211
C  2.339334 -0.326358 -0.32666
C  1.340146 0.709544 0.288255
C  -0.03086 0.722511 -0.42226
C  -0.65559 -0.709158 -0.314983
C  3.608056 -0.037354 0.596356
C  -2.116945 -0.759566 -0.931424
C  1.713542 -1.737812 -0.215304
C  0.311777 -1.780454 -0.888884
C  2.169731 2.011081 0.382013
C  -0.962577 1.805991 0.1718
C  3.60384 1.51262 0.756857
C  -2.918527 0.347275 -0.225899
C  -2.394515 1.755186 -0.438717
C  2.701768 -0.017927 -1.804463
C  -2.82469 -2.133185 -0.71569
C  -2.090436 -0.515943 -2.473348
C  4.931941 -0.586658 0.013698
C  -3.346303 -2.367374 0.715674
C  -3.94031 0.1072 0.654955
C  -4.299056 -1.244708 1.1301
C  5.392633 -1.964004 0.473524
C  -3.066633 4.099764 -0.192456
H  1.159884 0.374839 1.333712
H  0.129687 0.963315 -1.49394
H  -0.768491 -0.916541 0.773547
H  1.578312 -2.012398 0.852596
H  2.361515 -2.5064 -0.682834
H  0.424324 -1.643086 -1.981236
H  -0.110462 -2.791603 -0.740503
H  1.770464 2.707174 1.139799
H  2.178383 2.547247 -0.586339
H  -0.520534 2.805696 0.002389
H  -1.0623 1.664144 1.266523
H  4.381718 1.954735 0.113219
H  3.856012 1.739819 1.806367
H  -2.333003 1.9923 -1.525704
H  3.26666 0.922894 -1.907746
H  3.335042 -0.818418 -2.228198
H  1.800042 0.054962 -2.435366
H  -2.150245 -2.954661 -1.017927
H  -3.690372 -2.175906 -1.406875
H  -3.114787 -0.337205 -2.847843
H  -1.467023 0.343303 -2.773431
H  -1.699121 -1.410374 -2.991407
H  3.22367 -1.550708 1.909595
H  -2.508565 -2.389137 1.442988
H  -3.873203 -3.333584 0.803071
H  -4.483279 0.951034 1.092106
H  5.695674 -1.921303 1.536418
H  4.583236 -2.715348 0.392819
H  6.252315 -2.286554 -0.133128
H  -3.102919 4.213874 -1.297095
H  -2.096765 4.488664 0.178635
H  -3.884441 4.681042 0.261083
