program: Gaussian 09
title: 000165566
version: EM64L-G09RevD.01
frameworkgroup: C1[X(C19H24N2O2S)]
method: RPBEPBE
basis: SDD
operation: Freq
keyword: #p
keyword: freq=noraman
keyword: PBEPBE/SDD
title: #p freq=noraman PBEPBE/SDD
converged: YES YES NO NO
title: Mulliken charges:
elementType: S O O N N C C C C C C C C C C C C C C C C C C C H H H H H H H H H H H H H H H H H H H H H H H H
charge: 0.655858 -0.610434 -0.270944 -0.289620 -0.095653 -0.042362 -0.447718 -0.357188 0.542271 0.457131 -0.730388 -0.412203 -0.340896 -0.476997 -0.314128 -0.236585 -0.247917 -0.617744 -0.623219 0.353650 -0.383298 -0.237925 -0.251547 -0.536329 0.236208 0.218124 0.220057 0.195952 0.206575 0.258519 0.205682 0.197637 0.268094 0.252565 0.279393 0.284075 0.225393 0.190469 0.221011 0.227471 0.221600 0.193293 0.251048 0.229032 0.237629 0.223559 0.245728 0.225069
chargesum: 0.00000
title: Mulliken charges with hydrogens summed into heavy atoms:
elementType: S O O N N C C C C C C C C C C C C C C C C C C C
charge: 0.655858 -0.610434 -0.270944 -0.289620 -0.095653 0.193846 -0.009536 0.045339 0.542271 0.457131 -0.068551 -0.412203 -0.340896 -0.208903 -0.061563 0.042808 0.036158 0.019129 0.019146 0.353650 -0.132250 -0.008893 -0.013918 0.158027
polarizability: 2.83661192e+02 4.41819755e+01 2.66851133e+02 -3.50626114e+01 1.83832069e+01 2.08983522e+02
1716.lowfreq: -9.0646 0.0009 0.0013 0.0014 6.1717 8.1916 14.0496 18.3409 28.4204
frequency: 12.5030 18.0775 28.2986 39.9810 70.2419 76.0203 88.7091 101.5799 121.2414 130.6316 152.5958 160.1406 181.4955 210.3925 213.6076 226.0732 231.7505 236.6974 242.7152 253.5555 277.0556 292.6178 304.4285 320.2114 330.4162 362.2826 383.6324 387.6845 396.3292 418.5685 436.3995 442.1181 457.9943 484.7229 503.2891 523.9027 533.7383 582.0127 585.2891 618.5409 639.4719 648.7073 697.4525 719.3227 735.8809 761.4606 780.5657 796.6369 801.0522 804.5477 844.9811 851.4349 857.8243 900.5446 908.0309 937.1867 942.9393 946.6859 949.8828 981.9225 996.9676 1009.4333 1018.4661 1031.9363 1035.0606 1039.4821 1073.0505 1084.8361 1095.0982 1111.2611 1112.1868 1126.5652 1140.0122 1142.6331 1151.2933 1161.0191 1172.9372 1177.9947 1196.3320 1226.0363 1252.3514 1260.0985 1261.6930 1273.1183 1282.5504 1306.5628 1317.2044 1335.8419 1363.9333 1365.0319 1379.6068 1382.2716 1392.4981 1419.6209 1421.7407 1432.3160 1439.0785 1440.5944 1451.9109 1461.5476 1462.0541 1467.2013 1468.4138 1471.5058 1474.3033 1475.1513 1477.8208 1482.6108 1485.7667 1490.2808 1567.2984 1577.0861 1597.4270 1620.6086 2849.6283 2853.7173 2868.8904 2952.3613 2963.6422 2967.6033 2994.7735 3015.4599 3017.2798 3028.5475 3053.1301 3054.8911 3063.7428 3075.6981 3084.7861 3089.9544 3127.2727 3130.7465 3135.7050 3137.0499 3155.9309 3169.4965 3170.4969 3175.2751
redmass: 3.4773 3.1320 4.1729 5.2158 2.8231 4.1975 3.6111 3.8704 4.7405 5.3144 3.6926 6.7905 2.9326 2.8573 1.2175 1.5614 1.1243 1.2510 2.7106 2.7395 3.6736 4.0017 5.4646 2.9789 3.4536 5.0781 2.9521 2.6446 2.9076 3.9925 3.2429 2.7960 4.0925 4.1074 3.5322 4.4133 4.1594 4.8468 6.2016 5.7124 4.2834 6.2304 4.4013 4.3527 3.4157 1.3529 4.4443 10.9108 1.4603 3.4727 2.6113 1.7429 1.3743 2.0487 1.7507 1.9047 1.3336 1.3618 1.9875 1.3232 6.1585 5.0732 4.3971 1.6943 2.1297 1.9900 3.2811 1.3032 1.6864 2.1346 1.2616 1.6191 1.4511 1.6718 1.8878 1.4263 1.0921 1.7370 2.4509 1.9056 1.5383 2.4673 2.1058 1.6772 1.5157 1.4977 1.7291 1.3988 1.3910 1.3860 3.1063 1.5187 9.0820 1.1466 2.8911 1.7709 1.8831 1.1683 2.2153 1.0486 1.0783 1.0517 1.0702 1.7907 1.0609 1.2081 1.0735 1.1416 1.0542 1.0744 6.1001 6.8424 7.0285 7.4754 1.0613 1.0610 1.0593 1.0681 1.0327 1.0378 1.0856 1.0856 1.0734 1.0727 1.1041 1.0966 1.0944 1.1009 1.1006 1.0984 1.0997 1.0862 1.0898 1.0897 1.0931 1.0999 1.0914 1.0939
irintensity: 0.2649 0.4714 0.2414 2.2330 0.3788 0.4321 0.9305 6.7583 3.7508 2.3291 0.6243 6.4844 1.7951 1.2982 0.3692 1.3109 0.1192 0.0439 1.0756 2.2699 0.6418 0.5015 3.9813 3.9506 7.3994 2.9617 3.7770 4.1031 5.6812 13.1943 3.1540 0.0738 1.7267 25.4956 16.6163 7.9969 1.0158 11.9812 8.2218 4.0001 3.0854 0.6048 4.3483 1.7470 8.4625 95.4780 7.9846 52.5891 27.7714 8.2768 6.5246 45.3337 3.0161 7.6581 4.8127 10.6254 2.4011 2.3573 2.6970 0.4294 14.4778 14.9113 67.7333 36.9575 19.2650 40.4523 15.9548 1.2740 12.3185 25.7573 0.1409 45.5255 3.8013 0.5097 25.2260 27.8024 1.3277 60.8018 117.2445 31.9460 8.2613 94.3947 29.2726 2.8361 24.6598 9.2161 24.1590 3.4700 4.0940 2.5571 21.9218 9.2414 39.2201 3.7653 29.4768 23.1000 42.6625 0.4560 195.6624 10.7291 10.5701 11.9292 1.9033 70.0529 14.2964 19.8161 23.8070 7.7957 13.1551 11.8396 30.4464 54.2738 171.0519 86.7225 84.0805 42.4503 190.1416 38.2019 74.5457 45.5474 9.5709 15.9313 54.4465 38.6518 43.5523 9.6684 50.2916 32.8226 54.9224 12.1490 24.1277 3.4739 0.8589 3.3522 15.1967 26.3065 4.9606 10.0533
temp: 298.150 k
press: 1.00000 atm
elementType: 16 8 8 7 7 6 6 6 6 6 6 6 6 6 6 6 6 6 6 6 6 6 6 6 1 1 1 1 1 1 1 1 1 1 1 1 1 1 1 1 1 1 1 1 1 1 1 1
symmnumber: 1
zpe: 1026036.2 jmol-1
zpe.correction: 0.390797 hartree
zpe.thermalcorrener: 0.415184 hartree
zpe.thermalcorrenthalpy: 0.416129 hartree
zpe.thermalcorrgfe: 0.335084 hartree
zpe.sumelectzpe: -1394.526421 hartree
zpe.sumelectthermal: -1394.502033 hartree
zpe.sumelectthermalent: -1394.501089 hartree
zpe.sumelectthermalfe: -1394.582134 hartree
dipole: -0.0559 -3.8302 -2.4017
dipole: 4.5212
quadrupole: -129.5526 -157.0581 -151.8204
quadrupole: 15.7105 -0.6384 -11.6056
quadrupole: 16.5911 -10.9144 -5.6767 15.7105 -0.6384 -11.6056
hfenergy: -1394.9172173 hartree
pointgroup: C01 [X(C19H24N2O2S1)]
dipole: -0.2780062 -1.4874863 -0.9349741 debye
polarizability: 301.1791917|36.8229027|251.7137101|-28.7128672|25.2178443|206.6029459 unknown
InChI: InChI=1S/C19H24N2O2S/c1-14(12-20(2)3)13-21-16-7-5-6-8-18(16)24(22)19-10-9-15(23-4)11-17(19)21/h5-11,14H,12-13H2,1-4H3
charge 0 multiplicity 1
48 atoms
S  -0.133629 1.849487 1.71028
O  -0.733188 3.338511 2.182381
O  -4.543272 -1.413046 -0.864183
N  0.148685 -0.177695 -0.612221
N  3.196404 -2.652681 1.341552
C  1.969508 -1.931565 -0.748867
C  0.587504 -1.440109 -1.255096
C  1.872151 -2.37526 0.732884
C  -1.196966 -0.039671 -0.150494
C  0.925193 1.007023 -0.804049
C  2.485005 -3.081748 -1.639901
C  -1.526519 0.935283 0.82956
C  0.817532 2.099682 0.093354
C  -2.262637 -0.797239 -0.693346
C  1.776852 1.185062 -1.931466
C  -2.841841 1.1907 1.229242
C  1.4425 3.335829 -0.116091
C  3.101247 -3.556475 2.50716
C  3.946105 -1.421792 1.67082
C  -3.592039 -0.58139 -0.255482
C  -3.90153 0.426489 0.692826
C  2.44935 2.408826 -2.134347
C  2.273935 3.497576 -1.247689
C  -5.949277 -1.215434 -0.499839
H  2.686174 -1.091184 -0.818801
H  0.603478 -1.345992 -2.361741
H  -0.161419 -2.213269 -1.011084
H  1.279108 -3.3111 0.774216
H  1.306487 -1.603678 1.315635
H  3.407059 -3.498692 -1.200053
H  2.707123 -2.737159 -2.667604
H  1.739677 -3.898867 -1.70906
H  -2.104141 -1.526751 -1.491471
H  1.889851 0.381775 -2.665437
H  -3.024567 1.989084 1.957978
H  1.267607 4.145803 0.601911
H  2.615808 -4.502569 2.207958
H  2.521017 -3.124161 3.361935
H  4.115968 -3.794805 2.874312
H  4.090988 -0.803166 0.76899
H  4.945198 -1.690651 2.057682
H  3.432117 -0.790975 2.440391
H  -4.928315 0.615264 1.015336
H  3.098225 2.518735 -3.010423
H  2.782537 4.449612 -1.428786
H  -6.113572 -1.399439 0.579413
H  -6.505093 -1.957076 -1.091784
H  -6.29279 -0.195703 -0.760296
