program: Gaussian 09
title: 000165503
version: EM64L-G09RevD.01
frameworkgroup: C1[X(C7H11ClN6O)]
method: RPBEPBE
basis: SDD
operation: Freq
keyword: #p
keyword: freq=noraman
keyword: PBEPBE/SDD
title: #p freq=noraman PBEPBE/SDD
converged: NO NO NO NO
title: Mulliken charges:
elementType: Cl O N N N N N N C C C C C C C H H H H H H H H H H H
charge: 0.012822 -0.224745 -0.153512 -0.325784 -0.116085 0.060419 -0.000683 0.125373 -0.349519 -0.307873 0.147534 0.104809 -0.655746 -0.711757 -0.304314 0.248372 0.247580 0.236864 0.236917 0.343476 0.234350 0.238439 0.223047 0.227385 0.226743 0.235887
chargesum: 0.00000
title: Mulliken charges with hydrogens summed into heavy atoms:
elementType: Cl O N N N N N N C C C C C C C
charge: 0.012822 -0.224745 -0.153512 0.017692 -0.116085 0.060419 -0.000683 0.125373 0.146432 0.165908 0.147534 0.104809 0.040090 -0.021741 -0.304314
polarizability: 1.93109645e+02 -1.31563313e+00 1.70162946e+02 3.03333483e+00 2.91920770e+00 7.26219092e+01
1716.lowfreq: -16.1319 -8.1283 -0.0025 -0.0020 -0.0019 4.7180 5.1914 20.7427 53.6941
frequency: -15.0164 20.0714 53.6616 86.6599 90.7186 94.7789 140.1414 159.4438 198.6335 202.8048 208.3398 252.1370 268.4815 272.2867 292.2929 343.1903 348.4854 398.1904 451.4959 493.3354 533.1934 569.5379 645.4792 649.1042 702.0798 707.6835 749.9876 792.0877 793.9594 796.8598 843.6537 883.3461 922.1018 971.7800 1008.9570 1075.7166 1081.1789 1100.7767 1140.8860 1144.4980 1170.7653 1193.8717 1255.0315 1262.6537 1303.2469 1331.9213 1344.0347 1365.5654 1371.8556 1388.1563 1401.7091 1421.7475 1435.9155 1458.0754 1470.9985 1479.8448 1480.5492 1481.4568 1492.0763 1501.9895 1582.2147 2990.5210 2994.8494 2997.4541 3037.9931 3038.4781 3087.2099 3096.2644 3098.3954 3100.0849 3122.1169 3553.6505
redmass: 2.2949 4.5336 2.7020 3.7364 3.6545 5.4961 8.6672 11.1553 2.9527 1.5186 2.1109 7.6488 1.5237 6.5646 3.2390 6.5940 3.4233 6.8156 7.2725 4.9097 5.6974 1.1654 7.2671 9.3023 10.7941 2.2961 4.5830 3.1054 2.1152 1.8424 2.6210 12.0802 2.0161 2.5314 4.2473 2.9132 2.5154 3.0771 4.0695 1.5227 2.4164 3.6458 10.5917 1.1013 1.4189 1.4938 1.3172 4.6340 2.0040 1.3989 1.2388 2.0871 2.9324 1.8455 1.0477 1.0396 1.0978 1.0657 1.4607 1.8636 7.6624 1.0379 1.0581 1.0352 1.0612 1.1037 1.1015 1.0995 1.1001 1.0985 1.1035 1.0773
irintensity: 0.7653 0.8309 0.0943 1.0975 0.1913 0.2213 2.4232 0.7161 0.3206 0.7526 1.4368 1.2230 0.2500 2.3748 0.2666 20.3909 5.8031 4.9757 3.0509 2.6574 12.1572 91.3059 3.6587 8.0763 2.6522 10.5744 174.7557 56.0318 103.5748 10.6680 79.7467 9.4701 118.3983 42.9314 63.9516 49.8059 7.6598 98.9911 108.2108 2.2265 10.0354 75.8159 93.6345 0.0304 21.2033 94.3056 16.1509 360.4105 83.6209 74.8323 33.1474 261.3968 286.1272 121.6812 5.7717 14.1430 30.3153 12.9870 256.9528 195.9612 653.7879 25.7250 21.4416 21.3297 13.2235 8.8643 43.9243 26.4950 12.0541 25.7225 8.9568 88.6375
temp: 298.150 k
press: 1.00000 atm
elementType: 17 8 7 7 7 7 7 7 6 6 6 6 6 6 6 1 1 1 1 1 1 1 1 1 1 1
symmnumber: 1
zpe: 507208.9 jmol-1
zpe.correction: 0.193186 hartree
zpe.thermalcorrener: 0.208078 hartree
zpe.thermalcorrenthalpy: 0.209022 hartree
zpe.thermalcorrgfe: 0.149535 hartree
zpe.sumelectzpe: -1135.942281 hartree
zpe.sumelectthermal: -1135.927389 hartree
zpe.sumelectthermalent: -1135.926444 hartree
zpe.sumelectthermalfe: -1135.985931 hartree
dipole: 5.9829 -5.6979 -0.0270
dipole: 8.2621
quadrupole: -97.2013 -96.3042 -93.3212
quadrupole: -2.6133 -1.2835 -0.1098
quadrupole: -1.5924 -0.6953 2.2877 -2.6133 -1.2835 -0.1098
hfenergy: -1136.1354666 hartree
pointgroup: C01 [X(C7H11Cl1N6O1)]
dipole: -2.3678855 2.2265904 -0.0381155 debye
dipolederiv: -0.1126555 0.0514319 -0.0034378 0.0187234 -1.039002 0.0623481 0.0002797 0.0728756 -0.0799042 -1.3157596 -0.0655168 0.0602095 -0.8353598 -0.3065002 0.0427233 0.0599382 0.0031749 -0.1677043 -1.8850486 -0.5339928 0.0719511 0.1415756 -0.4414581 -0.0450491 0.0135717 -0.0103137 -0.2007483 -1.4718161 0.66049 -0.0408662 0.5282342 -0.6045722 0.0016234 -0.0159755 -0.0054706 -0.4430691 -1.7567363 0.0995681 -0.0041922 -0.1758944 -0.5572819 0.0247867 0.0627783 0.0184219 -0.1763644 -0.9434879 -0.5217937 0.0421251 -0.6180794 -1.5335784 0.0851602 0.0681104 0.1245922 -0.1257363 -1.1458531 0.4453722 -0.0213517 0.5929816 -1.2704184 0.0626065 -0.014852 0.0749413 -0.1781521 2.2061453 0.0927302 -0.097391 -0.0768665 0.0210321 -0.0202725 -0.0078408 0.0218209 -0.0194508 0.0166616 0.0283668 -0.0022778 0.1169367 0.3893924 0.0466886 0.0335756 0.0040558 0.2140961 0.3138842 -0.1317195 0.0115347 -0.3894522 0.6246807 -0.0182178 0.035386 -0.020509 0.2990345 1.9995015 0.5023183 -0.0306705 0.8339368 1.3781619 -0.0699528 -0.1002463 -0.0882138 0.1972016 2.1811923 -0.5949608 0.0241149 -0.4378024 0.9823139 -0.0485568 -0.0271855 -0.0425428 0.2194312 0.0529763 0.0100239 0.0070367 -0.0052233 -0.0063665 -0.0158835 -0.0246927 -0.0043261 -0.0436688 -0.0280848 0.0466061 -0.0007348 0.0986523 -0.017722 0.0058878 -0.0061753 0.0061687 0.0887993 1.4336497 0.0458502 -0.0225646 0.0450951 2.2389518 -0.1486327 -0.0459759 -0.1725195 0.0661577 -0.0104705 -0.0938374 0.1104073 0.0078358 0.0483791 -0.0168035 0.0370464 -0.0015071 0.0320434 0.0508238 0.0694678 -0.1094552 0.0437105 0.0522051 -0.0340971 -0.0912669 -0.0314604 0.0223865 0.0049823 -0.0434669 -0.0842683 0.066758 -0.0529584 -0.0430354 -0.0710249 -0.0822059 -0.0439999 0.0107579 -0.027678 0.0883388 0.0782676 -0.0317669 0.0389138 0.0545355 0.0805356 -0.0645183 0.2778179 -0.0321776 0.005124 0.0555956 0.1238789 0.0139282 -0.0014524 0.0148174 0.311798 -0.0396646 -0.0342801 0.1112165 -0.0559326 0.0786638 0.0398842 0.0808032 0.0288885 0.0178933 -0.0475175 0.0170923 -0.1119171 0.0702884 0.0961049 0.0289244 -0.048213 0.0024761 0.014959 0.1060651 0.0187729 0.0002949 -0.0066609 -0.1820405 0.0066605 0.0039348 0.0079048 0.0748051 0.0172552 -0.0233047 -0.0599255 -0.1028955 0.0624699 -0.103954 -0.093887 -0.083607 -0.0498623 0.0253275 -0.0112965 0.057631 -0.0840781 0.0863764 0.0869392 0.1035846 0.0642607 -0.082414 0.0600538 0.0259343 -0.0009318 0.0896537 -0.1389453 0.0173803 -0.0047561 0.0177417 0.1169872 unknown
polarizability: 193.1756855|-1.1396938|170.1402296|-1.7428999|-3.0614435|72.5785844 unknown
InChI: InChI=1S/C7H11ClN6O/c1-3-9-6-10-5(8)11-7(12-6)14(4-2)13-15/h9H,3-4H2,1-2H3
charge 0 multiplicity 1
26 atoms
Cl -0.134915 -4.061116 0.210743
O  4.123877 0.71624 -0.237346
N  1.872847 0.586544 -0.207224
N  -2.812888 0.182023 -0.039786
N  -0.471008 0.430402 -0.123242
N  0.890444 -1.584946 -0.010029
N  -1.526765 -1.768919 0.072324
N  3.140335 -0.088784 -0.176594
C  1.784403 2.065846 -0.302208
C  -3.06021 1.632911 -0.142268
C  0.723906 -0.226299 -0.10965
C  -1.576946 -0.384317 -0.03177
C  1.742624 2.735331 1.087154
C  -4.570203 1.916342 -0.129197
C  -0.276383 -2.259608 0.07562
H  2.680475 2.390682 -0.858651
H  0.876891 2.302003 -0.877439
H  -2.557001 2.14749 0.697972
H  -2.596931 2.014995 -1.071248
H  -3.600583 -0.465537 0.033636
H  0.851759 2.410117 1.650679
H  2.646221 2.494441 1.672095
H  1.695052 3.832149 0.96532
H  -5.078489 1.431499 -0.982341
H  -5.03822 1.561732 0.807072
H  -4.749792 3.00208 -0.204022
