program: Gaussian 09
title: 000165421
version: EM64L-G09RevD.01
frameworkgroup: C1[X(C9H11BrN2O5)]
method: RPBEPBE
basis: SDD
operation: Freq
keyword: #p
keyword: freq=noraman
keyword: PBEPBE/SDD
title: #p freq=noraman PBEPBE/SDD
converged: YES YES NO NO
title: Mulliken charges:
elementType: Br O O O O O N N C C C C C C C C C H H H H H H H H H H H
charge: 0.029098 -0.286357 -0.411943 -0.430150 -0.246302 -0.234983 -0.174899 -0.406982 -0.090650 -0.066229 -0.590847 -0.012980 -0.324708 0.245418 -0.039091 -0.309579 0.154997 0.265029 0.297824 0.329721 0.260631 0.199228 0.235051 0.367558 0.257297 0.364700 0.260202 0.358946
chargesum: 0.00000
title: Mulliken charges with hydrogens summed into heavy atoms:
elementType: Br O O O O O N N C C C C C C C C C
charge: 0.029098 -0.286357 -0.044385 -0.071204 -0.246302 -0.234983 -0.174899 -0.042283 0.174378 0.231595 -0.261126 0.247651 0.109572 0.245418 0.218206 -0.049376 0.154997
polarizability: 2.02208378e+02 2.19919257e+00 1.05064922e+02 -3.40156861e+00 1.51779952e+00 1.28564312e+02
1716.lowfreq: -0.0004 -0.0002 0.0006 1.7853 4.4557 8.9213 25.4192 34.8450 39.6268
frequency: 25.2799 34.8251 39.5803 69.7652 80.2507 119.3090 138.9620 157.4418 168.3356 175.5778 196.4051 251.3659 281.1847 311.3023 348.4138 374.8360 379.1297 413.4063 427.8125 455.0776 484.0867 515.7680 538.5718 557.0462 590.5056 638.0935 684.6961 700.6491 712.7321 744.1326 771.1722 804.0362 807.3630 838.9763 934.4345 942.2093 942.8520 957.7266 993.7855 1006.4824 1012.2365 1063.0453 1075.5894 1079.5390 1111.0152 1172.8312 1184.2536 1187.8393 1196.4406 1210.6007 1219.3127 1260.1857 1276.9554 1290.7817 1305.6777 1319.2324 1323.4710 1347.3291 1364.7941 1377.7319 1385.6747 1398.2004 1435.8103 1455.5308 1607.1882 1654.1245 1673.7438 2962.1459 2974.7382 3004.0591 3067.7484 3078.0275 3085.4944 3169.7262 3216.4981 3521.3360 3550.2375 3565.7663
redmass: 7.6595 11.3504 6.6375 8.1373 5.3402 6.4723 3.2809 5.7400 8.1275 7.8131 11.4035 5.2997 4.0635 1.1850 5.2984 8.4039 5.8586 3.3754 2.4969 1.4075 4.1686 6.4857 5.4340 4.8571 5.5997 5.1697 3.5006 2.1471 4.6685 8.3440 1.7594 3.4166 2.0207 4.4125 2.1618 2.1806 3.2840 4.5728 2.7290 2.2909 5.7241 2.7594 3.0526 4.8514 2.1815 1.2631 3.0463 1.2771 1.2582 2.1903 1.1859 1.7807 1.2196 1.2492 1.4113 1.5798 2.4165 1.2448 1.5258 1.5225 1.3584 1.5964 2.0693 1.0843 5.8392 11.0438 5.9827 1.0685 1.0843 1.0848 1.0861 1.0869 1.0956 1.0908 1.0976 1.0770 1.0658 1.0664
irintensity: 0.5745 0.2896 3.3640 1.7735 1.0169 1.9788 2.8751 6.7144 5.2556 1.5138 0.3125 10.8962 1.1258 156.0701 10.5522 19.8094 7.6872 16.9448 22.5535 164.6493 34.2184 13.0994 36.8758 4.1654 4.0847 17.0837 17.3935 10.7675 41.3959 19.8487 33.7807 84.4173 79.4986 9.5741 13.1138 78.9287 101.4483 156.0767 11.1584 7.0621 39.9872 39.5408 60.8199 15.6917 6.9866 8.9500 56.6523 38.4749 1.9321 89.1031 30.2536 148.3165 16.9352 31.9838 41.3804 28.7335 110.5235 25.3933 16.6999 8.0470 22.2130 10.3407 81.9436 4.8694 21.7024 269.5946 785.3903 42.2648 20.8204 28.4315 8.0193 4.1303 16.0803 3.9720 1.0127 65.1964 14.0207 17.7572
temp: 298.150 k
press: 1.00000 atm
elementType: 35 8 8 8 8 8 7 7 6 6 6 6 6 6 6 6 6 1 1 1 1 1 1 1 1 1 1 1
symmnumber: 1
zpe: 537114.3 jmol-1
zpe.correction: 0.204576 hartree
zpe.thermalcorrener: 0.221072 hartree
zpe.thermalcorrenthalpy: 0.222016 hartree
zpe.thermalcorrgfe: 0.157843 hartree
zpe.sumelectzpe: -847.354026 hartree
zpe.sumelectthermal: -847.337530 hartree
zpe.sumelectthermalent: -847.336586 hartree
zpe.sumelectthermalfe: -847.400759 hartree
dipole: -3.9784 -1.7237 -0.8219
dipole: 4.4130
quadrupole: -134.2333 -113.5695 -115.0431
quadrupole: 7.9906 0.7505 3.6364
quadrupole: -13.2846 7.3791 5.9055 7.9906 0.7505 3.6364
hfenergy: -847.558602 hartree
pointgroup: C01 [X(C9H11Br1N2O5)]
dipole: 1.3744951 -0.5402552 0.9128263 debye
polarizability: 197.9320869|-15.3175011|113.3267326|13.3131084|8.0438092|124.5787927 unknown
InChI: InChI=1S/C9H11BrN2O5/c10-6-4(3-13)17-8(7(6)15)12-2-1-5(14)11-9(12)16/h1-2,4,6-8,11,13,15H,3H2
charge 0 multiplicity 1
28 atoms
Br 3.810155 -1.168598 2.009919
O  1.276545 0.745075 -0.760477
O  0.977538 -2.679362 0.362169
O  3.352327 2.678748 -1.133425
O  -1.743263 -1.28941 -2.061064
O  -4.803397 0.955201 0.671055
N  -0.907899 -0.097693 -0.196726
N  -3.231227 -0.160671 -0.650467
C  1.209128 -1.268561 0.588706
C  0.468069 -0.478399 -0.52603
C  2.667111 -0.809007 0.385952
C  2.542104 0.685683 0.059515
C  3.653557 1.289266 -0.800961
C  -1.953791 -0.570412 -1.051698
C  -1.170384 0.764455 0.869451
C  -2.436629 1.156578 1.214983
C  -3.591778 0.681586 0.450397
H  0.859499 -0.949206 1.593167
H  0.413794 -1.084316 -1.446181
H  3.139658 -1.381253 -0.430106
H  2.395809 1.296281 0.972418
H  3.786975 0.669465 -1.713527
H  4.600185 1.31631 -0.236148
H  1.331443 -3.203354 1.124971
H  -0.289348 1.133972 1.400944
H  -4.003067 -0.501367 -1.233499
H  -2.616625 1.833991 2.049777
H  2.484611 2.696397 -1.614214
