program: Gaussian 09
title: 000165420
version: EM64L-G09RevD.01
frameworkgroup: C1[X(C10H18N2O6)]
method: RPBEPBE
basis: SDD
operation: Freq
keyword: #p
keyword: freq=noraman
keyword: PBEPBE/SDD
title: #p freq=noraman PBEPBE/SDD
converged: YES YES NO NO
title: Mulliken charges:
elementType: O O O O O O N N C C C C C C C C C C H H H H H H H H H H H H H H H H H H
charge: -0.265018 -0.451964 -0.436188 -0.432991 -0.312726 -0.269219 -0.401294 -0.398826 -0.076326 -0.212615 -0.201048 0.016259 -0.076725 -0.348275 0.279026 0.234413 -0.768650 -0.784780 0.300905 0.202936 0.275375 0.237008 0.215691 0.336340 0.201126 0.222043 0.368230 0.370335 0.340219 0.365070 0.257270 0.258734 0.220113 0.249291 0.250789 0.235473
chargesum: 0.00000
title: Mulliken charges with hydrogens summed into heavy atoms:
elementType: O O O O O O N N C C C C C C C C C C
charge: -0.265018 -0.081628 -0.095969 -0.067922 -0.312726 -0.269219 -0.064954 -0.030596 0.224579 -0.009680 0.074327 0.253268 0.138965 0.074894 0.279026 0.234413 -0.032534 -0.049226
polarizability: 1.68693278e+02 -4.86725514e+00 1.53343725e+02 7.33139723e+00 -1.38831012e+00 1.07629924e+02
1716.lowfreq: 0.0002 0.0004 0.0006 5.1242 7.3792 11.3431 29.8164 46.3732 66.5309
frequency: 29.7096 46.3325 66.5086 73.8721 81.1828 83.3391 92.1646 96.5191 104.1175 128.5820 160.8738 184.4882 208.7823 230.6420 235.8165 263.1575 284.5773 295.1575 325.9359 336.0923 352.9726 395.7407 420.1541 451.0067 475.6901 485.6198 496.8925 521.7236 546.1036 571.6932 576.1906 585.4229 603.0834 612.9912 660.1844 678.6332 782.5466 854.9731 909.3341 916.0278 925.2374 951.5669 967.0019 985.1666 990.8458 1001.7558 1027.1971 1043.5599 1045.6719 1048.4088 1054.5946 1076.6332 1086.7431 1123.0494 1140.6550 1174.6517 1182.3236 1189.7533 1204.8900 1243.3774 1265.9672 1269.3281 1278.9154 1298.8651 1309.0856 1327.9992 1334.3759 1340.7294 1356.2367 1360.2807 1370.9050 1385.1975 1387.9807 1390.4986 1393.9376 1449.8920 1452.8705 1463.3851 1466.6063 1468.9240 1491.2093 1520.8906 1603.7993 1627.4775 2887.7533 2910.8599 2966.8524 2968.8967 2997.2579 3001.5364 3007.5663 3063.7476 3087.9219 3090.1203 3100.3725 3107.4704 3115.7136 3325.7766 3520.6889 3526.0347 3528.1197 3534.3883
redmass: 6.8557 4.8203 2.4398 3.5793 1.3838 2.1540 4.3864 1.5458 6.0793 3.6614 4.9119 3.7729 4.4555 5.5376 5.1951 5.2023 4.7326 3.8574 3.8808 1.2677 3.4769 4.6297 3.6110 3.7984 1.5724 1.7098 1.2873 4.0271 4.2201 2.0764 1.9240 2.8482 2.8810 3.3276 3.9892 4.1563 1.2029 2.5523 5.1392 5.3928 6.2894 4.9036 5.1343 2.3515 1.6819 2.3434 2.7084 1.6720 1.9716 2.4126 2.2962 3.8575 2.6271 2.6358 3.4776 1.5117 1.3913 1.4415 1.6776 1.3010 1.2023 1.5420 1.7888 1.6561 1.7175 1.2467 1.3356 1.2864 1.3573 1.2034 1.3493 1.3232 1.2409 1.4399 1.3262 1.0484 1.0645 1.0849 1.1499 1.0893 1.9483 1.7385 4.7167 4.4644 1.0819 1.0819 1.0686 1.0836 1.0365 1.0361 1.0841 1.0858 1.0951 1.0979 1.0978 1.1013 1.1006 1.0835 1.0657 1.0773 1.0660 1.0656
irintensity: 0.6854 1.7941 1.5125 0.5030 1.7332 5.6995 19.7174 1.9714 8.9082 4.3194 3.8276 3.3496 1.6808 14.2853 2.7672 4.1877 0.7583 12.0423 2.5337 65.2693 7.4705 2.4853 9.4553 24.9346 81.2549 141.7491 116.8221 34.5110 9.9589 50.2140 71.9063 14.4836 2.7305 17.0201 7.7737 8.7250 128.9473 44.1710 52.5596 44.5129 108.5911 154.0136 98.3818 21.5909 27.9489 1.0156 19.5070 15.4591 5.2092 19.5920 4.7611 2.8639 91.7188 3.0265 7.5157 18.2763 51.4616 7.2071 19.1573 15.9285 24.1254 61.5491 125.6832 37.5877 36.3724 8.0534 24.1813 41.0800 5.1297 18.1038 3.0286 24.0638 76.0168 13.9458 57.5981 23.1220 27.6286 4.0444 88.6729 21.5567 243.2645 425.2782 128.8759 100.0799 35.8216 41.9770 53.7074 23.1743 6.7320 7.0463 13.0697 14.7417 21.9163 12.1293 5.8668 16.9897 13.0627 329.1995 40.9981 25.3220 7.6895 13.7418
temp: 298.150 k
press: 1.00000 atm
elementType: 8 8 8 8 8 8 7 7 6 6 6 6 6 6 6 6 6 6 1 1 1 1 1 1 1 1 1 1 1 1 1 1 1 1 1 1
symmnumber: 1
zpe: 759894.0 jmol-1
zpe.correction: 0.289428 hartree
zpe.thermalcorrener: 0.309322 hartree
zpe.thermalcorrenthalpy: 0.310266 hartree
zpe.thermalcorrgfe: 0.240493 hartree
zpe.sumelectzpe: -951.288664 hartree
zpe.sumelectthermal: -951.268771 hartree
zpe.sumelectthermalent: -951.267826 hartree
zpe.sumelectthermalfe: -951.337599 hartree
dipole: -2.2114 -5.2223 1.5622
dipole: 5.8825
quadrupole: -108.4213 -113.4688 -108.2672
quadrupole: -6.8300 -0.9740 -13.0621
quadrupole: 1.6311 -3.4164 1.7852 -6.8300 -0.9740 -13.0621
hfenergy: -951.5780922 hartree
pointgroup: C01 [X(C10H18N2O6)]
dipole: -0.8300505 -2.025521 0.751288 debye
polarizability: 168.0747705|-3.3327236|152.4557463|10.8589057|-5.1946893|109.1364092 unknown
InChI: InChI=1S/C10H18N2O6/c1-4(14)11-7-9(17)8(16)6(3-13)18-10(7)12-5(2)15/h6-13,16-17H,3H2,1-2H3
charge 0 multiplicity 1
36 atoms
O  1.222745 0.997916 -0.469623
O  0.688282 -3.053521 0.480826
O  3.31964 -1.902795 0.780529
O  3.706302 2.386735 -0.290764
O  -2.84141 -0.508034 -1.272181
O  -0.658297 3.244917 1.079767
N  -1.55654 -1.438886 0.429851
N  -1.111314 1.453583 -0.3381
C  -0.279222 -0.878803 -0.051061
C  0.882369 -1.61354 0.645204
C  2.245935 -1.164989 0.081239
C  -0.066593 0.643289 0.209703
C  2.389102 0.367119 0.186467
C  3.608512 0.950545 -0.534285
C  -2.73495 -1.30471 -0.279629
C  -1.352494 2.7367 0.148987
C  -3.905822 -2.15457 0.189734
C  -2.496199 3.47759 -0.532433
H  -0.211857 -1.031185 -1.147288
H  0.864288 -1.359358 1.734134
H  2.33843 -1.493528 -0.968866
H  0.05577 0.868901 1.290865
H  2.414918 0.674574 1.259979
H  -1.481991 -2.211113 1.097478
H  3.525303 0.725002 -1.618986
H  4.53982 0.508393 -0.144758
H  -1.748727 1.001708 -1.015943
H  1.551787 -3.491062 0.706989
H  3.456807 -1.505307 1.680343
H  2.817895 2.782718 -0.492803
H  -4.761155 -1.497184 0.420627
H  -4.218514 -2.819221 -0.634124
H  -3.67553 -2.768546 1.07654
H  -3.07901 4.021423 0.22857
H  -2.078221 4.228872 -1.226947
H  -3.162658 2.807567 -1.10164
