program: Gaussian 09
title: 000165499
version: EM64L-G09RevD.01
frameworkgroup: C1[X(C14H30O4S)]
method: RPBEPBE
basis: SDD
operation: Freq
keyword: #p
keyword: freq=noraman
keyword: PBEPBE/SDD
title: #p freq=noraman PBEPBE/SDD
converged: YES YES NO NO
title: Mulliken charges:
elementType: S O O O O C C C C C C C C C C C C C C H H H H H H H H H H H H H H H H H H H H H H H H H H H H H H
charge: 1.197926 -0.413331 -0.544102 -0.478207 -0.481769 -0.385805 -0.388701 -0.386252 -0.378758 -0.384832 -0.377225 -0.382169 -0.406707 -0.372720 0.011339 -0.353393 -0.356594 -0.697400 -0.696457 0.194619 0.194670 0.195659 0.194559 0.194707 0.193439 0.198167 0.191665 0.193145 0.193644 0.217004 0.193838 0.191624 0.192633 0.226310 0.206082 0.189318 0.189577 0.238681 0.187890 0.187521 0.194551 0.194921 0.228081 0.214449 0.259320 0.209759 0.215197 0.209641 0.384486
chargesum: 0.00000
title: Mulliken charges with hydrogens summed into heavy atoms:
elementType: S O O O O C C C C C C C C C C C C C C
charge: 1.197926 -0.413331 -0.159615 -0.478207 -0.481769 0.003484 0.001517 0.001894 0.011074 0.001957 0.033616 0.002088 0.025685 0.006174 0.250020 0.022018 0.032878 0.004451 -0.061860
polarizability: 2.49908322e+02 -1.22004860e+00 1.87302499e+02 1.10508572e-01 -2.61696242e+00 1.58574533e+02
1716.lowfreq: -3.0488 -0.0017 -0.0008 0.0008 2.2224 9.0740 15.5711 18.9699 23.8388
frequency: 15.2115 18.9258 23.5338 26.9584 34.5686 45.3972 50.0784 72.3909 73.3966 87.6102 100.8058 118.6194 123.0816 134.0474 137.5176 147.2337 150.8488 156.0509 168.8108 189.7713 214.1545 224.6136 237.4503 248.9548 263.0715 286.4318 304.2355 319.9431 337.7411 361.3437 401.9660 411.6671 455.8412 467.4473 501.3250 507.3894 537.5992 595.7754 717.5469 719.1013 721.6367 727.7124 740.7337 761.0463 789.8802 829.2069 862.6315 877.6512 888.0488 895.6946 928.1747 969.1421 971.2606 977.2005 987.7267 1001.4315 1011.5700 1025.8542 1033.3763 1053.4718 1059.1684 1073.8586 1079.5560 1081.7914 1082.1550 1094.7487 1101.6177 1119.5141 1127.9077 1159.4720 1181.6938 1202.5843 1203.3236 1228.4176 1229.9856 1252.6420 1254.0392 1272.8369 1276.3109 1278.3210 1283.2878 1287.5904 1290.5306 1295.2839 1296.4961 1298.9630 1317.2621 1322.5186 1334.9663 1348.7816 1354.0941 1355.4301 1357.5968 1358.4456 1388.4864 1392.8183 1441.3837 1458.9914 1459.1481 1461.6885 1462.7317 1464.9130 1465.0706 1468.3100 1473.0343 1476.2280 1478.0971 1481.7503 1482.7920 1486.6460 1489.0111 2948.1435 2948.4053 2949.6676 2950.5650 2951.5204 2954.3642 2958.7587 2963.3518 2967.5854 2968.3002 2971.5871 2974.9576 2981.1342 2983.7633 2987.8475 2991.6178 2993.8517 2995.7903 3001.6561 3011.2427 3020.5962 3027.3586 3034.4728 3041.4987 3052.7897 3067.9366 3070.3036 3087.7383 3106.0052 3475.0294
redmass: 4.6729 6.0184 4.6378 1.9139 4.4146 3.2177 1.6632 3.3985 3.6907 1.6480 3.2667 1.7859 2.8720 5.7730 2.4620 1.9376 2.7860 2.3762 2.2872 2.6230 1.2452 1.1349 4.3011 3.0260 2.4865 3.0101 4.1347 6.4701 6.9414 3.6194 3.7179 4.0014 3.0991 3.7329 3.0562 3.1976 9.4254 6.4401 1.2625 1.0946 1.1304 1.2086 1.3454 1.3977 1.3244 1.2794 10.4972 1.2631 1.9087 2.1888 1.2540 2.6784 1.4819 4.5515 3.4402 1.5139 2.8697 2.1141 1.3975 2.9149 2.4726 2.6191 2.0445 2.2635 2.1580 1.5506 1.9476 2.0327 2.9888 2.0026 1.8721 1.3405 1.5390 1.4107 1.3333 1.3180 1.3092 1.2244 1.2510 1.0520 1.0671 1.1377 1.0855 1.1136 1.1235 1.2851 1.3597 1.1707 1.4218 1.5068 1.7260 1.6231 1.6425 1.6349 1.2182 1.2195 1.0773 1.0740 1.0740 1.0692 1.0711 1.0674 1.0555 1.0816 1.0834 1.0429 1.0861 1.0460 1.0909 1.0931 1.0953 1.0587 1.0587 1.0589 1.0591 1.0594 1.0595 1.0593 1.0589 1.0593 1.0608 1.0364 1.0613 1.0961 1.0968 1.0980 1.0372 1.0994 1.0862 1.1016 1.1027 1.1021 1.1022 1.1043 1.1044 1.1033 1.1006 1.0993 1.0981 1.1009 1.0662
irintensity: 0.5086 1.0600 0.9628 0.1678 0.3464 0.2191 0.0462 0.5537 0.0380 0.0074 0.5865 0.0100 0.6044 6.2802 0.1043 0.0104 0.1436 0.0999 33.1023 0.1602 4.7218 0.0011 2.6418 31.4093 43.9732 20.6561 6.9276 8.0180 4.1989 17.7842 3.9102 34.5383 7.9881 12.4362 3.9365 3.2541 78.9743 157.0694 9.8468 18.3826 2.1414 14.3302 9.1955 20.9038 8.1994 9.8089 113.4931 0.6891 7.3477 12.6754 0.9161 41.5768 25.7717 0.1966 1.5775 6.8883 2.9264 1.7422 1.0296 0.7281 4.1530 0.4325 0.4881 0.8986 0.2182 63.7010 38.3432 3.7068 6.8891 13.7455 1.3433 16.0525 2.7656 1.8367 0.0778 1.7015 0.8700 0.9144 0.3891 0.3049 1.0616 0.3814 0.4413 0.3032 0.1038 0.0728 3.6986 24.0303 2.1070 2.5806 0.3051 6.7151 0.1165 1.0972 11.1526 28.6489 4.8281 0.0316 0.1196 0.4538 0.1497 0.5428 11.6231 0.6259 1.6714 12.2878 1.4824 12.6746 3.3622 3.1170 38.1746 0.0042 0.2123 0.3375 0.1413 0.2706 4.6007 0.8218 76.2864 95.2352 137.8512 39.0392 49.6173 0.0903 0.4875 0.9692 22.9954 1.0954 7.5740 2.1128 1.9058 6.0455 2.3043 1.3599 215.2121 124.3340 98.5169 55.3472 27.1356 13.1346 50.4784
temp: 298.150 k
press: 1.00000 atm
elementType: 16 8 8 8 8 6 6 6 6 6 6 6 6 6 6 6 6 6 6 1 1 1 1 1 1 1 1 1 1 1 1 1 1 1 1 1 1 1 1 1 1 1 1 1 1 1 1 1 1
symmnumber: 1
zpe: 1107574.7 jmol-1
zpe.correction: 0.421853 hartree
zpe.thermalcorrener: 0.448145 hartree
zpe.thermalcorrenthalpy: 0.449089 hartree
zpe.thermalcorrgfe: 0.360147 hartree
zpe.sumelectzpe: -1248.658516 hartree
zpe.sumelectthermal: -1248.632224 hartree
zpe.sumelectthermalent: -1248.631280 hartree
zpe.sumelectthermalfe: -1248.720221 hartree
dipole: -3.9248 2.3355 -0.5871
dipole: 4.6047
quadrupole: -168.3344 -123.6208 -133.2466
quadrupole: 15.6606 -2.0018 -0.3121
quadrupole: -26.6005 18.1131 8.4873 15.6606 -2.0018 -0.3121
hfenergy: -1249.0803687 hartree
pointgroup: C01 [X(C14H30O4S1)]
dipole: 1.5342568 -0.9018491 -0.3386717 debye
polarizability: 249.8757704|-1.6567188|186.4671218|-0.9512004|5.5628541|159.442461 unknown
InChI: InChI=1S/C14H30O4S/c1-3-4-5-6-7-8-9-10-11-12-13-14(2)18-19(15,16)17/h14-15H,3-13H2,1-2H3
charge 0 multiplicity 1
49 atoms
S  -6.253329 1.364505 0.395757
O  -5.142486 -0.018915 0.816358
O  -5.161251 2.300594 -0.758882
O  -7.471616 0.907117 -0.536738
O  -6.434967 2.186545 1.757743
C  1.533176 -0.93248 0.080728
C  0.148821 -0.309596 -0.208819
C  2.708962 0.031266 -0.196056
C  -1.022957 -1.284436 0.044435
C  4.089125 -0.572609 0.148223
C  -2.408218 -0.650618 -0.215324
C  5.268157 0.37919 -0.155008
C  -3.565284 -1.639764 0.036642
C  6.644215 -0.206363 0.234604
C  -4.968364 -1.072299 -0.258023
C  7.825859 0.73669 -0.085485
C  9.199412 0.159527 0.326462
C  -6.099185 -2.101481 -0.165555
C  10.375419 1.104331 -0.002886
H  1.570914 -1.260879 1.14061
H  1.659119 -1.849125 -0.532858
H  0.115939 0.038835 -1.262393
H  0.016478 0.594101 0.422238
H  2.694973 0.329547 -1.265384
H  2.563073 0.96423 0.38805
H  -0.976689 -1.646778 1.092658
H  -0.8990 -2.179873 -0.600293
H  4.108538 -0.848285 1.223572
H  4.227821 -1.518443 -0.416611
H  -2.537104 0.233552 0.437965
H  -2.454788 -0.28467 -1.262125
H  5.112934 1.337433 0.384168
H  5.268707 0.629175 -1.236759
H  -3.542108 -1.997684 1.084663
H  -3.442511 -2.535193 -0.607217
H  6.647072 -0.441353 1.319796
H  6.794516 -1.172512 -0.291776
H  -4.970308 -0.559556 -1.241429
H  7.834599 0.959182 -1.173257
H  7.669593 1.708726 0.428116
H  9.352635 -0.814266 -0.182616
H  9.191073 -0.05765 1.414296
H  -6.120156 -2.563837 0.836802
H  -5.93999 -2.899384 -0.914294
H  -7.078594 -1.636104 -0.366334
H  10.26411 2.073195 0.519926
H  11.344821 0.666891 0.299516
H  10.422985 1.313859 -1.08834
H  -4.489941 2.790561 -0.199064
