program: Gaussian 09
title: 000165368
version: EM64L-G09RevD.01
frameworkgroup: C1[X(C13H11NO4)]
method: RPBEPBE
basis: SDD
operation: Freq
keyword: #p
keyword: freq=noraman
keyword: PBEPBE/SDD
title: #p freq=noraman PBEPBE/SDD
converged: YES YES NO NO
title: Mulliken charges:
elementType: O O O O N C C C C C C C C C C C C C H H H H H H H H H H H
charge: -0.226682 -0.253289 -0.342656 -0.307579 -0.397534 0.260399 0.142596 0.076634 0.211797 0.110310 0.077887 -0.382032 -0.319791 0.059390 -0.309474 -0.196879 -0.522682 -0.521650 0.371824 0.260011 0.262912 0.243971 0.270945 0.250515 0.231161 0.231699 0.294387 0.218154 0.205654
chargesum: 0.00000
title: Mulliken charges with hydrogens summed into heavy atoms:
elementType: O O O O N C C C C C C C C C C C C C
charge: -0.226682 -0.253289 -0.342656 -0.307579 -0.025710 0.260399 0.142596 0.076634 0.211797 0.110310 0.077887 -0.122021 -0.056879 0.059390 -0.065503 0.074067 0.190693 0.196546
polarizability: 3.09254231e+02 2.44625146e+01 1.84972179e+02 -1.77763685e+00 1.67907758e-01 7.32152770e+01
1716.lowfreq: 0.0003 0.0005 0.0009 1.0559 1.5615 7.2517 49.9015 71.2205 82.0047
frequency: 49.8966 71.2200 81.9995 119.3044 128.0370 156.7644 160.6202 178.7152 216.7804 257.0797 262.7768 285.4825 300.9310 316.4659 330.2079 348.1598 374.1359 378.6438 483.1524 506.2395 518.3552 557.7590 584.0508 589.2849 611.0392 630.8766 680.3524 717.7946 727.3402 737.2022 756.3060 760.7601 781.1135 831.9353 844.6528 860.2747 923.8285 937.5183 972.7151 975.4247 1010.0858 1056.1104 1067.6012 1111.9079 1121.4347 1138.8711 1141.4754 1166.6669 1180.9402 1189.7808 1234.5882 1250.5456 1290.6919 1317.3552 1350.9790 1397.2058 1419.1882 1442.9282 1447.6365 1451.1238 1464.1101 1473.1462 1474.7112 1490.9461 1495.7214 1514.6522 1537.4860 1563.9137 1602.9322 1655.7827 2971.2879 2981.3678 3082.0352 3082.6667 3128.6609 3134.9522 3145.4336 3174.0559 3249.4137 3285.6410 3488.5508
redmass: 3.0612 5.5892 4.0219 4.9661 2.9493 1.6904 3.2014 3.3223 3.8341 1.1526 4.6868 6.2975 5.8056 5.0102 6.4644 5.0017 9.1426 5.3701 6.8221 7.4965 5.6862 4.2233 4.3559 5.6725 5.1406 4.6193 1.4841 3.3702 6.5290 1.3052 7.5457 7.3576 6.1073 1.6987 1.3400 7.0839 7.2836 5.4710 1.2880 4.9051 3.8023 3.2785 3.0315 1.2423 1.2486 1.4549 1.4383 1.5553 1.7609 2.5249 1.8741 2.9946 2.7897 3.1106 2.2969 2.5768 1.3182 2.6714 2.2610 1.1407 2.8938 1.0602 1.0790 1.7891 1.7561 7.0005 6.2946 6.7399 8.4068 8.8379 1.0336 1.0316 1.0987 1.1054 1.1058 1.1009 1.0875 1.0967 1.0916 1.1076 1.0770
irintensity: 5.1374 0.7073 1.6457 13.8197 1.6537 1.3418 0.7986 0.6917 0.3784 0.0859 4.8490 7.8957 3.1964 0.9383 5.8771 8.2155 3.2932 6.4863 20.4558 22.7275 2.4031 12.9870 0.3935 2.0036 10.0621 3.4391 100.9310 0.7005 8.5049 74.2678 1.1245 5.7641 7.3079 38.4284 8.0259 4.5364 15.6156 19.5243 0.1719 4.6811 26.2761 155.8137 84.4545 0.0512 31.7558 24.6977 65.6205 35.1889 54.2504 40.9408 2.9850 23.9946 1.3134 115.1083 111.3652 140.9315 245.5182 32.1300 5.3010 17.1833 250.2657 14.9986 12.5005 89.7854 73.8340 35.8169 80.0382 141.1575 22.2182 368.3896 121.5602 55.9016 41.8435 33.9092 7.7668 17.8036 3.9633 9.7521 9.3438 4.2073 121.0013
temp: 298.150 k
press: 1.00000 atm
elementType: 8 8 8 8 7 6 6 6 6 6 6 6 6 6 6 6 6 6 1 1 1 1 1 1 1 1 1 1 1
symmnumber: 1
zpe: 566968.8 jmol-1
zpe.correction: 0.215947 hartree
zpe.thermalcorrener: 0.231488 hartree
zpe.thermalcorrenthalpy: 0.232432 hartree
zpe.thermalcorrgfe: 0.173511 hartree
zpe.sumelectzpe: -856.294955 hartree
zpe.sumelectthermal: -856.279414 hartree
zpe.sumelectthermalent: -856.278470 hartree
zpe.sumelectthermalfe: -856.337391 hartree
dipole: -9.2514 -1.5781 1.3284
dipole: 9.4786
quadrupole: -100.5983 -94.5774 -107.1782
quadrupole: -13.5476 4.5993 -0.7893
quadrupole: 0.1863 6.2072 -6.3936 -13.5476 4.5993 -0.7893
hfenergy: -856.5109024 hartree
pointgroup: C01 [X(C13H11N1O4)]
dipole: -3.7262511 0.0978664 0.1099659 debye
polarizability: 311.3522543|-0.056252|180.2250532|24.6595435|-3.4406416|75.8643791 unknown
InChI: InChI=1S/C13H11NO4/c1-16-11-7-3-4-9(15)12(17-2)10(7)14-13-8(11)5-6-18-13/h3-6,14H,1-2H3
charge 0 multiplicity 1
29 atoms
O  -2.483002 -2.176299 -0.311741
O  -1.564557 2.566621 -0.216692
O  2.346096 -2.063611 0.082023
O  4.34682 0.15505 0.211035
N  -0.211005 -1.44748 -0.084594
C  0.197287 0.989385 -0.045128
C  0.704902 -0.373145 0.008205
C  -2.102554 0.113726 -0.269033
C  -1.194151 1.230886 -0.180789
C  -1.528329 -1.178712 -0.214633
C  2.062048 -0.678707 0.127112
C  1.178133 2.042722 0.047538
C  -3.5371 -0.126119 -0.413275
C  3.071525 0.377817 0.174435
C  2.524941 1.747666 0.161293
C  -3.735471 -1.487581 -0.435607
C  -2.975014 2.953089 -0.346644
C  3.450918 -2.558861 0.939813
H  0.192683 -2.391355 -0.062611
H  0.82859 3.078233 0.020152
H  -4.33478 0.606146 -0.491645
H  3.273027 2.546672 0.218043
H  -4.602781 -2.133091 -0.524514
H  -2.962798 4.052308 -0.340591
H  -3.56806 2.583661 0.509228
H  -3.398696 2.592264 -1.301079
H  4.360081 -1.968397 0.745233
H  3.579328 -3.615072 0.656878
H  3.166321 -2.479815 2.00709
