program: Gaussian 09
title: 000165347
version: EM64L-G09RevD.01
frameworkgroup: C1[X(C4H10ClN)]
method: RPBEPBE
basis: SDD
operation: Freq
keyword: #p
keyword: freq=noraman
keyword: PBEPBE/SDD
title: #p freq=noraman PBEPBE/SDD
converged: YES YES NO NO
title: Mulliken charges:
elementType: Cl N C C C C H H H H H H H H H H
charge: -0.056950 -0.196983 -0.312592 -0.312615 -0.670217 -0.670218 0.218455 0.215899 0.215892 0.218460 0.237727 0.231021 0.206687 0.231021 0.237726 0.206686
chargesum: 0.00000
title: Mulliken charges with hydrogens summed into heavy atoms:
elementType: Cl N C C C C
charge: -0.056950 -0.196983 0.121762 0.121738 0.005218 0.005215
polarizability: 7.04074470e+01 -6.54311520e-04 7.10039984e+01 -8.09544461e-05 -1.40166303e-02 4.69763282e+01
1716.lowfreq: -21.3032 -11.5378 -0.0023 -0.0020 0.0002 7.9098 97.6130 118.1839 189.7477
frequency: 97.6047 118.1830 189.7454 205.6156 221.3757 253.7897 344.4634 415.3542 457.9739 490.5187 785.9561 803.7211 822.7632 923.6372 1028.6152 1048.0246 1079.2604 1123.1191 1134.6023 1138.1631 1247.4847 1286.3159 1323.0258 1368.2402 1391.7973 1395.8506 1431.9335 1444.6932 1461.3932 1462.1258 1485.2839 1486.4379 2926.2665 2934.1767 2993.4950 2995.8815 2996.7690 3005.6711 3091.8493 3092.0839 3106.4632 3107.2184
redmass: 2.2972 1.5462 1.4968 1.8276 1.5142 2.4183 2.9359 3.3367 2.7119 5.0833 1.1549 2.2397 1.2619 2.8117 1.6651 2.4640 2.1168 2.1742 2.0695 1.7178 1.1472 1.1250 1.3336 1.3377 1.2211 1.2662 1.0823 1.0774 1.0411 1.0402 1.0493 1.0491 1.0608 1.0609 1.0731 1.0370 1.0601 1.0957 1.0990 1.0989 1.1007 1.1006
irintensity: 0.0197 0.1299 0.6582 1.7256 0.4196 3.8255 6.2594 0.9744 1.5790 21.4482 0.0140 1.9603 34.8904 0.0000 19.1898 4.9634 0.0003 2.0588 4.1368 5.6624 0.1669 1.3335 17.0551 9.0437 38.1710 8.6385 2.1498 7.2377 1.2325 29.7625 7.2302 16.2156 0.5401 106.1629 44.1280 1.1377 12.4973 31.5700 14.8744 42.7567 0.3028 47.4860
temp: 298.150 k
press: 1.00000 atm
elementType: 17 7 6 6 6 6 1 1 1 1 1 1 1 1 1 1
symmnumber: 1
zpe: 357186.6 jmol-1
zpe.correction: 0.136045 hartree
zpe.thermalcorrener: 0.144138 hartree
zpe.thermalcorrenthalpy: 0.145082 hartree
zpe.thermalcorrgfe: 0.103604 hartree
zpe.sumelectzpe: -672.677902 hartree
zpe.sumelectthermal: -672.669809 hartree
zpe.sumelectthermalent: -672.668864 hartree
zpe.sumelectthermalfe: -672.710342 hartree
dipole: 0.0003 -2.3899 -1.2575
dipole: 2.7005
quadrupole: -41.9203 -44.3196 -46.5353
quadrupole: 0.0000 0.0000 0.4410
quadrupole: 2.3381 -0.0612 -2.2769 0.0000 0.0000 0.4410
hfenergy: -672.8139467 hartree
pointgroup: C01 [X(C4H10Cl1N1)]
dipole: -0.0001416 -1.0207186 0.2949359 debye
dipolederiv: -0.2392338 -0.0000981 -0.0000021 -0.0000458 -0.6529045 -0.0884379 -0.0000192 -0.2995608 -0.1720127 -0.3203776 0.000122 0.0000188 0.0001245 0.5003311 0.2010616 0.0000207 0.3164914 -0.1886321 0.3366065 0.1417448 -0.0051711 0.015111 0.0383349 -0.0276172 -0.0096409 -0.0816315 0.2687097 0.3365065 -0.1418284 0.0051822 -0.0152213 0.0383302 -0.0276292 0.0096606 -0.0816013 0.2687288 -0.13181 0.0436518 -0.0417763 0.0453356 0.0392318 0.0048503 -0.0189664 0.0323367 0.0299167 -0.1318172 -0.0436203 0.0418117 -0.0453034 0.0392614 0.004849 0.0190076 0.0323419 0.0299033 0.0051474 0.0114205 0.0167957 0.0321093 -0.120239 -0.0604801 0.0505065 -0.0483184 0.0760663 -0.0339922 -0.0250183 -0.0452638 -0.0146192 0.0806216 0.0275265 0.0568476 0.108102 -0.2068442 -0.0339868 0.0250777 0.0452109 0.0146498 0.0806093 0.027529 -0.0568911 0.1081337 -0.2068719 0.0051349 -0.0114443 -0.0167902 -0.0321459 -0.1202314 -0.0604822 -0.0504922 -0.048311 0.0760874 0.1133011 -0.0051911 -0.0064234 0.0764558 -0.0700378 -0.0635974 0.0008379 -0.0868952 0.0638488 0.1008633 0.0150126 0.0325566 0.0260192 0.0909218 0.0175269 -0.0344755 0.0166706 -0.141783 -0.1102589 -0.1003742 0.0318897 -0.1344289 0.0174571 0.0454815 0.0471738 0.051242 0.0904013 0.1008571 -0.0150028 -0.0326251 -0.0260151 0.0909229 0.017572 0.0344063 0.0166937 -0.1417803 0.1132891 0.0051317 0.0063966 -0.0765139 -0.0699978 -0.0635934 -0.0008796 -0.0869109 0.0638272 -0.1102293 0.1004163 -0.0318103 0.1344882 0.0173884 0.0454407 -0.0470962 0.051217 0.0904345 unknown
polarizability: 70.4074469|0.0012077|70.0210549|-0.0023474|4.7593968|47.9592719 unknown
InChI: InChI=1S/C4H10ClN/c1-3-6(5)4-2/h3-4H2,1-2H3
charge 0 multiplicity 1
16 atoms
Cl 0.000288 1.733109 0.5416
N  -0.000073 -0.045552 -0.247923
C  -1.241604 -0.719237 0.262586
C  1.241378 -0.719507 0.262226
C  -2.521036 -0.0711 -0.278119
C  2.520824 -0.071592 -0.278756
H  -1.158194 -1.755116 -0.12871
H  -1.259332 -0.78052 1.373714
H  1.259428 -0.78085 1.373353
H  1.157695 -1.755378 -0.12905
H  -2.659211 0.940053 0.139601
H  -2.472133 0.012081 -1.377479
H  -3.400759 -0.683493 -0.008773
H  2.471616 0.011742 -1.378092
H  2.659336 0.93948 0.139056
H  3.400478 -0.684221 -0.009735
