program: Gaussian 09
title: 000165319
version: EM64L-G09RevD.01
frameworkgroup: C1[X(C12H20N2)]
method: RPBEPBE
basis: SDD
operation: Freq
keyword: #p
keyword: freq=noraman
keyword: PBEPBE/SDD
title: #p freq=noraman PBEPBE/SDD
converged: YES YES NO NO
title: Mulliken charges:
elementType: N N C C C C C C C C C C C C H H H H H H H H H H H H H H H H H H H H
charge: -0.127239 -0.070693 -0.189586 -0.350365 -0.466010 -0.434991 -0.608237 -0.588921 0.483753 -0.277005 -0.288790 -0.137790 -0.133302 -0.575755 0.302533 0.292597 0.297901 0.305603 0.227070 0.306614 0.260622 0.268288 0.264254 0.308494 0.285111 0.265166 0.295813 0.294607 0.295936 0.305741 0.320951 0.309300 0.258371 0.299961
chargesum: 2.00000
title: Mulliken charges with hydrogens summed into heavy atoms:
elementType: N N C C C C C C C C C C C C
charge: -0.127239 -0.070693 0.112947 0.240133 0.066662 0.132245 0.232798 0.257169 0.483753 0.017602 0.007146 0.167950 0.187649 0.291877
polarizability: 1.68066115e+02 -2.00336009e+00 1.28258764e+02 -5.25722122e+00 -7.54913064e+00 9.74288184e+01
1716.lowfreq: -10.4048 -10.1256 -0.0008 -0.0008 -0.0006 10.0865 26.7130 29.3973 39.5588
frequency: 25.0930 28.5417 39.4072 89.9001 138.6921 203.9312 236.0928 242.6592 264.1234 268.2630 294.6792 316.0833 372.3210 385.8882 413.5513 416.4329 442.3070 522.8824 530.1557 551.9293 568.1710 650.1580 669.9736 699.2406 749.5120 756.9708 833.5649 855.5291 894.0871 910.0504 918.2580 929.4127 958.2980 959.7019 968.3886 1002.1322 1018.2292 1021.2895 1055.9960 1073.4286 1074.4047 1088.4694 1111.0917 1121.4086 1138.6843 1157.3172 1171.6933 1197.3344 1208.2941 1214.3572 1217.0442 1245.1445 1260.4868 1295.9397 1322.8416 1325.9422 1335.8458 1342.9555 1353.2477 1376.7470 1421.7796 1424.0963 1445.8659 1457.2794 1459.2082 1463.6193 1464.8399 1467.2186 1470.0723 1477.5246 1484.2234 1488.7887 1490.8760 1502.0712 1569.9508 1626.7268 3011.7103 3020.7862 3023.8976 3025.9120 3033.6511 3036.8083 3054.8402 3093.3876 3108.9471 3131.6848 3132.6801 3136.0136 3139.3467 3143.4098 3146.3387 3154.3421 3157.3260 3188.4101 3191.7831 3204.1150
redmass: 2.0946 1.1108 3.2395 3.7314 3.0520 2.9216 2.3049 2.9470 2.5818 1.0970 1.9950 1.3730 2.6896 2.2956 2.8057 2.7829 2.9489 5.0154 2.8706 3.3973 2.7868 5.5440 3.4288 2.0532 2.9675 3.6624 1.4218 1.7425 2.0320 1.7102 2.9394 2.4973 1.9418 2.7115 1.4163 2.3128 1.5297 3.3987 1.8135 1.6333 1.6980 1.3254 1.7523 1.3714 1.5800 1.9948 1.4579 1.5658 1.5160 1.3477 1.6173 2.1557 1.2555 1.3743 1.5737 1.2724 1.3983 2.6592 1.3201 1.4386 1.1993 1.2485 1.1487 1.3064 1.0489 1.1746 1.1027 1.2957 1.1207 1.0689 1.0617 1.0494 1.0890 1.7511 4.8762 4.9968 1.0667 1.0323 1.0333 1.0336 1.0835 1.0645 1.0610 1.1005 1.1036 1.1078 1.1049 1.1057 1.1053 1.1059 1.1061 1.1043 1.0937 1.0933 1.0951 1.1020
irintensity: 0.0956 0.5253 0.5581 0.8548 0.5239 1.8256 0.2808 0.8865 0.6429 0.0479 0.5012 0.1909 0.0368 0.0407 0.8727 2.2849 1.7944 5.8088 0.8310 0.9374 3.2705 2.9231 2.5312 38.0458 16.5263 4.2620 49.3323 10.0030 2.7321 18.4687 7.7577 10.3918 7.7503 12.4648 3.0985 8.6569 0.6206 1.5116 4.0938 1.0108 0.1928 0.1568 1.1640 2.0933 6.2058 23.5122 1.8733 4.9121 1.4811 0.6862 6.2009 11.5012 3.3163 5.6453 9.7507 1.2053 2.6813 3.1608 1.6084 2.8548 43.6938 2.2377 6.4167 5.3290 1.4411 19.7470 8.5199 25.2226 16.8922 53.1508 21.9801 40.8158 24.3776 63.0011 0.2025 11.4633 10.5542 1.5188 5.7144 2.2196 2.4866 4.6245 2.8707 2.1884 2.3057 1.4009 0.2767 0.7434 5.2555 0.5314 5.8988 1.3197 0.2333 5.3222 4.5004 14.2182
temp: 298.150 k
press: 1.00000 atm
elementType: 7 7 6 6 6 6 6 6 6 6 6 6 6 6 1 1 1 1 1 1 1 1 1 1 1 1 1 1 1 1 1 1 1 1
symmnumber: 1
zpe: 799608.5 jmol-1
zpe.correction: 0.304555 hartree
zpe.thermalcorrener: 0.318637 hartree
zpe.thermalcorrenthalpy: 0.319581 hartree
zpe.thermalcorrgfe: 0.262505 hartree
zpe.sumelectzpe: -577.106201 hartree
zpe.sumelectthermal: -577.092119 hartree
zpe.sumelectthermalent: -577.091175 hartree
zpe.sumelectthermalfe: -577.148251 hartree
dipole: -2.2049 0.4153 1.3554
dipole: 2.6213
quadrupole: -1.6888 -54.8856 -69.6514
quadrupole: 3.8219 0.1043 -3.5697
quadrupole: 40.3864 -12.8103 -27.5761 3.8219 0.1043 -3.5697
hfenergy: -577.410756 hartree
pointgroup: C01 [X(C12H20N2)]
dipole: -0.8698203 0.1610504 0.5301061 debye
polarizability: 168.1105726|-1.1274638|127.4872077|-5.2514855|-8.9373179|98.1559177 unknown
InChI: InChI=1S/C12H20N2/c1-13-8-4-6-11(10-13)12-7-5-9-14(12,2)3/h4,6,8,10,12H,5,7,9H2,1-3H3
charge 2 multiplicity 1
34 atoms
N  2.004172 0.45755 0.537286
N  -2.630469 -0.631564 0.275058
C  1.03962 -0.015179 -0.649785
C  3.287508 -0.447307 0.376986
C  1.530868 -1.439232 -0.969457
C  3.066229 -1.289871 -0.892001
C  1.399688 0.240641 1.920271
C  2.363553 1.934492 0.37817
C  -0.451003 0.203614 -0.401553
C  -1.274712 -0.810697 0.13384
C  -1.077574 1.414199 -0.807223
C  -2.469842 1.587337 -0.646736
C  -3.234465 0.547759 -0.099168
C  -3.492522 -1.739288 0.817472
H  1.337917 0.641435 -1.487748
H  3.348558 -1.074587 1.28002
H  4.168598 0.210579 0.337742
H  1.188985 -1.759559 -1.967319
H  1.175296 -2.186062 -0.235093
H  3.581414 -2.26024 -0.816469
H  3.455291 -0.779462 -1.790169
H  0.540556 0.912568 2.065955
H  1.093215 -0.810415 2.032541
H  2.168221 0.469552 2.674835
H  2.88225 2.083644 -0.581117
H  1.44663 2.543644 0.415513
H  3.027872 2.233264 1.203758
H  -0.892597 -1.788257 0.434283
H  -0.490063 2.213734 -1.272145
H  -2.968799 2.509502 -0.954002
H  -4.316406 0.616294 0.038722
H  -4.166973 -2.097145 0.022909
H  -2.860116 -2.570454 1.15973
H  -4.083101 -1.36019 1.666195
