program: Gaussian 09
title: 000165301
version: EM64L-G09RevD.01
frameworkgroup: C1[X(C4H7NO4)]
method: RPBEPBE
basis: SDD
operation: Freq
keyword: #pfreq=noraman
keyword: PBEPBE/SDD
title: #p freq=noraman PBEPBE/SDD
converged: YES YES NO NO
title: Mulliken charges:
elementType: O O O O N C C C C H H H H H H H
charge: -0.442715 -0.208046 -0.357543 -0.240156 -0.369453 -0.352534 -0.310088 0.156973 0.109055 0.237722 0.240538 0.228181 0.226566 0.348728 0.340388 0.392384
chargesum: 0.00000
title: Mulliken charges with hydrogens summed into heavy atoms:
elementType: O O O O N C C C C
charge: -0.102327 -0.208046 0.034841 -0.240156 -0.020726 0.125726 0.144660 0.156973 0.109055
polarizability: 8.06760801e+01 -1.00895070e+00 6.55334691e+01 7.90976413e+00 -4.48164973e+00 4.33082404e+01
1716.lowfreq: -15.6728 -7.1729 -0.0011 -0.0005 0.0005 4.2645 29.6242 62.9055 69.1148
frequency: 29.5552 62.8951 69.1029 115.8221 195.4401 250.7645 299.7964 329.2990 388.2362 435.3552 498.5913 528.9929 633.0277 646.5006 679.9076 772.6998 793.4521 855.2381 890.7634 998.1770 1035.2345 1076.8492 1102.0653 1175.7881 1197.3583 1269.6888 1329.3513 1332.4804 1349.6947 1372.6736 1432.7705 1464.4224 1487.1358 1619.1346 1641.1583 2993.7584 3015.0487 3085.5648 3094.4328 3511.5055 3517.8197 3565.7401
redmass: 6.3821 7.0018 8.2771 2.6374 4.4866 4.1234 1.2300 3.7000 3.2679 3.9702 9.9669 2.5638 3.7149 1.3385 1.1182 9.5557 3.1820 2.8975 2.6594 2.5332 3.3803 1.9489 2.6995 1.2833 2.1026 1.2190 1.5312 1.6872 1.3051 1.2114 1.1157 1.0835 1.8876 9.6555 9.3156 1.0653 1.0599 1.1011 1.1031 1.0643 1.0779 1.0662
irintensity: 3.5567 3.5751 9.0207 3.2807 8.0512 21.0236 168.5778 19.1642 25.6396 3.7284 0.4446 5.1092 60.2222 153.6069 127.5537 1.7839 6.4794 37.2104 20.8807 57.8937 166.1217 28.9104 101.9865 20.1087 10.7090 20.4229 46.3678 15.4523 6.8548 21.4195 25.3774 5.7722 123.2031 264.3675 108.2480 32.8704 21.8249 14.3938 30.1083 47.9370 53.0276 5.3296
temp: 298.150 k
press: 1.00000 atm
elementType: 8 8 8 8 7 6 6 6 6 1 1 1 1 1 1 1
symmnumber: 1
zpe: 311886.1 jmol-1
zpe.correction: 0.118791 hartree
zpe.thermalcorrener: 0.128611 hartree
zpe.thermalcorrenthalpy: 0.129556 hartree
zpe.thermalcorrgfe: 0.082157 hartree
zpe.sumelectzpe: -511.559355 hartree
zpe.sumelectthermal: -511.549535 hartree
zpe.sumelectthermalent: -511.548591 hartree
zpe.sumelectthermalfe: -511.595989 hartree
dipole: -0.9961 -1.3963 0.7941
dipole: 1.8901
quadrupole: -49.9598 -61.3427 -49.9673
quadrupole: 7.2718 4.6303 2.7235
quadrupole: 3.7968 -7.5861 3.7893 7.2718 4.6303 2.7235
hfenergy: -511.6781465 hartree
pointgroup: C01 [X(C4H7N1O4)]
dipole: -0.3901607 -0.5375128 0.3343789 debye
dipolederiv: -0.2600724 0.089988 0.2063695 0.2030839 -0.7001986 -0.1088661 0.2536056 -0.0787129 -0.6218718 -0.5114613 -0.0919826 -0.0127959 0.3036477 -0.8048364 0.1867346 -0.1374766 0.1173715 -0.3912038 -1.02115 0.414929 -0.2832752 0.3141016 -0.3855378 0.088632 -0.2789907 0.1205526 -0.4956912 -0.7081629 -0.1383025 -0.0531766 0.0440973 -0.8767691 0.2031238 -0.1317672 0.1251677 -0.3903197 -0.9374704 0.2207678 -0.1073124 0.1857568 -0.5329415 0.0503193 -0.0797681 0.0753504 -0.5462427 0.4027847 0.0777589 0.0783688 0.1392716 0.1278919 0.0596212 0.1725994 -0.0531443 0.1611305 0.2880574 -0.0598284 -0.0736131 -0.1594626 0.593954 0.0829348 -0.1984809 0.1681794 0.3582707 0.8251995 -0.1917714 0.2069528 -0.4880399 0.9498777 -0.3062606 0.2950095 -0.2839218 0.3772125 1.3483902 -0.1808862 0.3234972 -0.2724503 1.0205532 -0.3227297 0.4040496 -0.2768959 0.4444796 -0.013396 0.0055126 -0.0469582 0.0045565 0.0652289 0.1201509 -0.0676065 0.0690554 -0.0420349 0.028971 0.0702935 0.0337376 -0.0388032 -0.057457 -0.0889862 0.0022501 -0.0375421 0.081388 -0.1226629 -0.0936575 -0.035365 -0.0537189 0.0063085 -0.0382374 -0.0025887 -0.0587905 0.0851268 0.0411839 0.1003098 -0.0756244 0.0553618 -0.0536372 0.0465175 -0.0312487 0.0573877 -0.0820903 0.2399736 -0.011407 -0.0260483 -0.0276289 0.2123823 0.0279871 -0.0524579 0.0167717 0.3176875 0.0859391 -0.1072535 -0.1362474 -0.0774338 0.2566566 -0.0317598 -0.1586168 0.0019867 0.3451867 0.3138765 -0.1044704 0.0014905 -0.1323398 0.1785247 0.0308187 0.0114877 0.0371846 0.3989722 unknown
polarizability: 80.690512|-0.6522165|65.1366308|7.9339346|-5.3313599|43.6906467 unknown
InChI: InChI=1S/C4H7NO4/c6-2-1-5-3(7)4(8)9/h5-6,8H,1-2H2
charge 0 multiplicity 1
16 atoms
O  3.036613 -1.034976 -0.705335
O  -0.560694 1.708042 -0.287302
O  -2.948815 0.298095 -0.540923
O  -1.901069 -1.589434 0.321733
N  0.435959 -0.207889 0.628753
C  1.748475 0.413244 0.871482
C  2.674447 0.346146 -0.361672
C  -0.610417 0.502591 0.08039
C  -1.870103 -0.382369 -0.024062
H  2.227224 -0.110709 1.716613
H  1.586894 1.472269 1.145552
H  3.629808 0.842478 -0.125363
H  2.202059 0.870048 -1.216265
H  0.25279 -1.176237 0.90926
H  2.245189 -1.487677 -1.091907
H  -3.739159 -0.306521 -0.590354
