program: Gaussian 09
title: 000165303
version: EM64L-G09RevD.01
frameworkgroup: C1[X(C16H16O2)]
method: RPBEPBE
basis: SDD
operation: Freq
keyword: #pfreq=noraman
keyword: PBEPBE/SDD
title: #p freq=noraman PBEPBE/SDD
converged: YES YES NO NO
title: Mulliken charges:
elementType: O O C C C C C C C C C C C C C C C C H H H H H H H H H H H H H H H H
charge: -0.298213 -0.268500 -0.053601 -0.350180 -0.310853 0.335774 0.507437 -0.706972 0.496983 -0.345665 -0.374509 -0.468211 -0.351086 -0.449838 -0.377022 -0.221525 -0.224726 -0.249726 0.250051 0.222570 0.227980 0.223421 0.215773 0.225823 0.223766 0.247353 0.248210 0.231248 0.244964 0.231075 0.241863 0.224474 0.224359 0.227500
chargesum: 0.00000
title: Mulliken charges with hydrogens summed into heavy atoms:
elementType: O O C C C C C C C C C C C C C C C C
charge: -0.298213 -0.268500 0.196450 0.100370 0.128341 0.335774 0.507437 -0.257382 0.496983 -0.098312 -0.126299 -0.236963 -0.106122 -0.218763 -0.135159 0.002949 -0.000367 -0.022226
polarizability: 2.56197980e+02 7.53914878e+00 1.40493651e+02 -1.57192431e+01 -6.31157983e-01 1.32614828e+02
1716.lowfreq: -18.7288 -4.6282 -0.0006 -0.0003 0.0003 4.2167 16.5159 23.5666 34.8119
frequency: 14.1028 23.4941 34.6992 45.2490 65.5561 90.8483 112.0421 155.4994 192.5086 209.2691 284.0645 297.9747 325.3857 351.2899 404.2413 405.6470 415.8678 456.2739 479.4663 506.9111 541.9531 603.4951 615.9696 634.6778 703.6417 708.0148 728.1002 746.5705 780.3194 795.8721 803.9165 819.9860 829.7154 841.6783 855.8498 899.5253 906.4145 935.1558 956.2813 967.2653 970.7583 978.0883 986.7668 990.8707 995.4424 1004.0414 1026.0083 1028.8555 1081.1404 1098.3863 1112.8429 1115.7361 1140.2151 1170.9139 1178.9017 1184.3195 1188.5563 1196.9025 1212.5687 1218.9285 1226.7692 1238.8311 1284.3402 1313.1674 1336.4646 1351.0426 1380.2169 1382.9822 1414.8489 1419.0387 1439.3173 1461.7048 1473.3645 1483.2577 1483.9002 1500.8166 1584.5053 1593.1246 1613.0669 1623.3292 2963.2262 2967.8800 3013.3005 3025.4576 3071.9264 3114.4844 3116.1986 3119.6507 3119.9081 3131.1685 3133.0408 3143.5029 3159.2722 3161.6842 3163.8878 3181.8599
redmass: 5.4336 4.1355 3.7143 4.6257 4.2133 4.8253 3.2851 5.7854 4.8579 4.2614 3.5027 4.6947 4.4133 3.1238 2.8187 2.3443 2.7924 3.5756 3.8933 2.7328 5.8316 4.1972 6.3954 6.5436 2.3216 3.3879 2.3041 3.2483 3.4997 3.0690 3.4473 1.5006 4.1043 1.7611 1.2474 1.2044 1.4269 1.4383 1.7455 2.2918 1.4110 1.3896 3.0694 6.0286 1.3246 2.7551 2.2272 1.4363 1.5997 1.3625 1.3273 1.3320 1.5585 1.0602 1.3097 1.1374 1.1971 2.4975 1.4971 1.6778 3.1333 1.4602 1.5693 1.3798 1.3462 1.3928 4.9722 5.5476 2.4044 2.4829 2.0978 1.1543 1.1934 1.8539 1.3121 2.3532 6.9510 6.1048 6.0723 6.4408 1.0556 1.0596 1.1001 1.1068 1.0531 1.0865 1.0919 1.0890 1.0866 1.0888 1.0913 1.0960 1.0938 1.1015 1.0957 1.1192
irintensity: 0.1734 0.0652 0.2350 1.4397 1.3764 2.7891 5.0129 1.2392 0.3836 5.9001 8.5691 2.9175 5.0860 3.5793 0.1997 0.2689 0.1628 12.1517 2.0357 16.9928 7.9966 14.5876 0.5227 1.3458 31.3086 5.1632 34.7765 12.0365 46.2056 30.2387 25.8532 4.7714 3.7793 38.7575 0.0880 3.8075 7.8700 2.4748 6.9556 18.3223 1.0342 0.1176 81.3574 0.0784 0.6882 10.5708 9.8971 0.2255 12.4981 3.6811 12.5787 19.6107 2.0063 0.2757 112.1016 6.0601 0.6284 0.3819 82.2558 54.9188 88.3228 8.3039 2.9913 2.1176 0.8813 11.5687 10.7624 6.4701 9.2479 0.6420 7.0314 20.7137 22.3325 30.3975 9.8352 139.6982 11.5698 2.0758 7.0864 43.9643 33.4926 32.3676 13.3324 29.4956 24.0675 8.4411 15.7701 17.0428 2.3105 13.0755 13.3428 45.5752 18.8139 25.3818 3.8498 30.0192
temp: 298.150 k
press: 1.00000 atm
elementType: 8 8 6 6 6 6 6 6 6 6 6 6 6 6 6 6 6 6 1 1 1 1 1 1 1 1 1 1 1 1 1 1 1 1
symmnumber: 1
zpe: 721441.3 jmol-1
zpe.correction: 0.274782 hartree
zpe.thermalcorrener: 0.290888 hartree
zpe.thermalcorrenthalpy: 0.291833 hartree
zpe.thermalcorrgfe: 0.227535 hartree
zpe.sumelectzpe: -768.394957 hartree
zpe.sumelectthermal: -768.378851 hartree
zpe.sumelectthermalent: -768.377907 hartree
zpe.sumelectthermalfe: -768.442204 hartree
dipole: -0.8951 0.3554 0.7843
dipole: 1.2420
quadrupole: -110.8985 -100.6075 -103.1037
quadrupole: -0.0707 5.7210 0.1935
quadrupole: -6.0286 4.2624 1.7662 -0.0707 5.7210 0.1935
hfenergy: -768.6697394 hartree
pointgroup: C01 [X(C16H16O2)]
dipole: -0.337957 -0.2877785 -0.2043037 debye
polarizability: 254.4472873|4.4589089|137.9211455|22.2800231|-3.2385924|136.9380263 unknown
InChI: InChI=1S/C16H16O2/c1-2-4-13(5-3-1)10-14-6-8-15(9-7-14)17-11-16-12-18-16/h1-9,16H,10-12H2
charge 0 multiplicity 1
34 atoms
O  6.629889 0.763735 0.708027
O  3.10136 0.369234 -0.517748
C  5.382247 0.962511 -0.120216
C  6.440478 0.02004 -0.597687
C  4.121143 0.450918 0.539621
C  1.80905 -0.039978 -0.134132
C  -0.868321 -0.844928 0.416761
C  -2.291878 -1.319233 0.703065
C  -3.401805 -0.418148 0.160794
C  1.440537 -0.406518 1.181704
C  0.8468 -0.069832 -1.174307
C  0.106638 -0.803708 1.439326
C  -0.47243 -0.467215 -0.895811
C  -4.492899 -0.968928 -0.556835
C  -3.382174 0.982115 0.392897
C  -5.543055 -0.146592 -1.027501
C  -4.428751 1.80686 -0.073665
C  -5.515323 1.245499 -0.785976
H  5.304938 1.950707 -0.590279
H  6.280866 -1.06008 -0.491028
H  7.11402 0.330193 -1.404828
H  3.789442 1.149306 1.335136
H  4.300835 -0.54554 0.991348
H  -2.412484 -1.422662 1.800293
H  -2.432014 -2.336553 0.285181
H  2.164121 -0.38939 2.002298
H  1.154497 0.22174 -2.18339
H  -0.173141 -1.086391 2.461944
H  -1.21279 -0.477279 -1.704188
H  -4.520703 -2.049119 -0.749192
H  -2.536883 1.423672 0.934375
H  -6.377713 -0.590939 -1.581835
H  -4.398137 2.886045 0.115921
H  -6.326961 1.88556 -1.149872
