program: Gaussian 09
title: 000012973
version: EM64L-G09RevD.01
frameworkgroup: C1[X(C6H13NO)]
method: RPBEPBE
basis: SDD
operation: Freq
keyword: #p
keyword: freq=noraman
keyword: PBEPBE/SDD
title: #p freq=noraman PBEPBE/SDD
converged: NO YES NO NO
title: Mulliken charges:
elementType: O N C C C C C C H H H H H H H H H H H H H
charge: -0.293107 -0.132948 -0.495712 -0.353112 0.263389 -0.690384 -0.631540 -0.615039 0.220539 0.220438 0.221228 0.221427 0.222635 0.203443 0.203404 0.228400 0.228588 0.257518 0.218643 0.218647 0.283544
chargesum: 0.00000
title: Mulliken charges with hydrogens summed into heavy atoms:
elementType: O N C C C C C C
charge: -0.293107 -0.132948 -0.054735 0.089543 0.263389 -0.060902 0.082966 0.105794
polarizability: 9.48109593e+01 5.28299459e+00 7.60122571e+01 1.05973543e-02 1.79215491e-02 5.69323848e+01
1716.lowfreq: -9.0070 -7.9931 -0.0007 -0.0005 0.0004 13.8040 31.8873 77.2428 80.1827
frequency: 29.4213 76.9171 79.9693 127.8557 143.2752 158.0660 228.1044 247.9084 310.5273 326.0539 388.7311 464.5611 551.4162 590.5004 744.7281 778.5587 880.1971 896.8695 962.9977 1050.3463 1055.1619 1088.9923 1093.4923 1099.3557 1145.2674 1146.0062 1222.7494 1241.2366 1272.5204 1291.8371 1344.5490 1387.0779 1391.6098 1409.0352 1440.0186 1453.4496 1470.4092 1471.9547 1476.0963 1478.1828 1484.9255 1489.0020 1505.7685 1587.2936 2956.2068 2962.4646 2965.7472 2970.5134 3011.7356 3014.3363 3019.2282 3037.6563 3048.4739 3073.9928 3081.9701 3117.8941 3126.8493
redmass: 1.2253 1.8828 2.4534 1.1183 3.1923 1.9964 1.1333 2.3553 4.0108 2.8664 3.0107 3.4123 2.6724 4.5401 1.1545 4.7599 1.3559 2.0363 2.4774 1.6267 1.9084 1.5110 1.2247 2.1586 1.3831 2.1741 1.3247 5.6333 1.5189 1.0896 1.6434 2.3222 1.3321 1.1773 1.1312 1.1215 1.0574 1.0421 1.0870 1.0428 1.0793 1.0454 1.1939 6.4172 1.0386 1.0590 1.0365 1.0364 1.0989 1.0618 1.1009 1.1016 1.0997 1.0982 1.1029 1.0967 1.0939
irintensity: 0.6416 0.1484 0.6156 0.0855 2.9601 1.7050 0.5921 8.0993 6.1060 2.4248 9.2157 3.4303 1.6049 4.0194 12.0442 1.7094 0.3773 9.7073 20.0834 4.2016 4.8589 0.6359 0.0246 35.5698 0.2911 112.6446 0.4215 19.0096 11.2157 0.3964 3.6954 93.0174 9.0451 47.8850 6.6869 14.0967 7.4043 2.3301 10.4713 12.9336 13.7807 28.9786 20.3026 252.7317 50.6460 21.6862 108.5867 34.7255 15.3115 16.4191 43.8840 38.5245 6.4157 50.5315 75.7311 1.7922 16.0309
temp: 298.150 k
press: 1.00000 atm
elementType: 8 7 6 6 6 6 6 6 1 1 1 1 1 1 1 1 1 1 1 1 1
symmnumber: 1
zpe: 481317.9 jmol-1
zpe.correction: 0.183324 hartree
zpe.thermalcorrener: 0.193938 hartree
zpe.thermalcorrenthalpy: 0.194883 hartree
zpe.thermalcorrgfe: 0.146518 hartree
zpe.sumelectzpe: -365.751119 hartree
zpe.sumelectthermal: -365.740505 hartree
zpe.sumelectthermalent: -365.739561 hartree
zpe.sumelectthermalfe: -365.787926 hartree
dipole: 1.3031 3.8622 0.0022
dipole: 4.0761
quadrupole: -44.2232 -54.7904 -50.0864
quadrupole: 1.7494 0.0031 -0.0070
quadrupole: 5.4768 -5.0904 -0.3864 1.7494 0.0031 -0.0070
hfenergy: -365.9344436 hartree
pointgroup: C01 [X(C6H13N1O1)]
dipole: 0.5158753 1.5184092 -0.0016249 debye
dipolederiv: -0.7230652 -0.0177433 -0.000357 -0.3714195 -1.0918574 0.0010838 -0.0000455 0.0010832 -0.3439998 -1.1235721 -0.3664487 -0.000675 -0.1983754 -0.6489284 -0.0006309 0.0014518 0.0024205 -0.3363108 -0.2436135 0.0903103 -0.0006056 0.2137722 -0.0723791 0.0009101 -0.0019673 0.0009445 0.1919584 0.1381691 -0.0021129 0.0000285 0.0251962 0.0645998 0.0001633 0.0001075 0.0000268 0.13484 1.4691173 0.4161934 0.0006179 0.4963809 1.1695048 -0.0016943 0.0011232 -0.0019628 0.1153936 -0.0662513 0.0500603 -0.0002116 0.0192981 0.0557477 0.0002041 -0.0000608 0.0002862 0.1105515 0.0814391 0.1206926 -0.0001345 0.2224355 0.4413949 0.0022998 -0.0008594 0.0011901 0.2836309 0.3610676 -0.0828136 0.0006571 -0.2709943 -0.0048294 0.0001727 0.0003109 -0.0001828 0.2767375 0.0258148 -0.0008139 -0.0186263 -0.0125568 -0.0226953 -0.1000879 -0.0257689 -0.1241638 -0.0508497 0.0258367 -0.0008721 0.0186833 -0.0124357 -0.0212054 0.0998802 0.0262379 0.1238777 -0.0521234 0.0425516 0.0159334 -0.0125547 -0.0164488 -0.0051428 0.1043555 -0.0040509 0.1147153 -0.0629049 0.042864 0.0161902 0.0124891 -0.0163805 -0.0065683 -0.1046511 0.0042212 -0.1149198 -0.0610721 -0.168478 -0.094442 0.0003704 -0.1359099 0.0115785 0.0003972 0.0005785 0.0003887 0.1003419 0.0767428 -0.003483 0.0246495 0.0500799 -0.0204669 0.1266668 -0.0243039 0.1386313 -0.0970473 0.076749 -0.0037804 -0.0246968 0.050235 -0.0227089 -0.1272627 0.0238442 -0.1392548 -0.0948375 -0.0011803 -0.110604 0.1084115 -0.0659938 -0.0109788 0.0169576 0.1347391 0.1036351 -0.0832001 0.0035473 -0.1091265 -0.1054485 -0.0669405 -0.0139676 -0.0189597 -0.1328747 -0.1072346 -0.0875 -0.037625 0.1336517 -0.0028031 0.0919234 0.0336902 0.0004847 -0.0024154 0.0008415 0.1082536 -0.084514 0.0105049 -0.0838947 -0.0280693 0.0939273 -0.0862903 -0.1528334 -0.0419036 -0.0912636 -0.0852261 0.0105556 0.0840727 -0.02844 0.0941192 0.0857285 0.152671 0.0415741 -0.0903092 0.1896263 -0.071852 0.0000279 0.0546434 -0.0228342 0.0002727 -0.0001051 0.0000073 0.129711 unknown
polarizability: 94.8330299|5.2435123|75.9901599|0.0309574|-0.0143834|56.9324114 unknown
InChI: InChI=1S/C6H13NO/c1-4-5-6(8)7(2)3/h4-5H2,1-3H3
charge 0 multiplicity 1
21 atoms
O  0.268485 -1.661462 0.003374
N  1.565306 0.267869 0.000767
C  -0.93804 0.477553 -0.001621
C  -2.224727 -0.373418 0.000806
C  0.333203 -0.390186 0.001771
C  -3.494846 0.502634 -0.002805
C  1.748821 1.724411 -0.000918
C  2.803958 -0.528874 0.004933
H  -0.93677 1.146592 0.88354
H  -0.936143 1.140346 -0.891527
H  -2.215914 -1.03794 0.883625
H  -2.21507 -1.044228 -0.877184
H  -4.407006 -0.121296 -0.000016
H  -3.534808 1.151126 -0.899082
H  -3.534538 1.158703 0.887957
H  2.326743 2.043283 -0.891474
H  2.307658 2.049099 0.899805
H  0.78435 2.249929 -0.013228
H  3.409126 -0.305806 0.90527
H  3.413518 -0.307965 -0.892912
H  2.525793 -1.593471 0.005717
