program: Gaussian 09
title: 000165271
version: EM64L-G09RevD.01
frameworkgroup: C1[X(C6H11N3O)]
method: RPBEPBE
basis: SDD
operation: Freq
keyword: #p
keyword: freq=noraman
keyword: PBEPBE/SDD
title: #p freq=noraman PBEPBE/SDD
converged: YES YES NO NO
title: Mulliken charges:
elementType: O N N N C C C C C C H H H H H H H H H H H
charge: -0.490871 -0.556645 -0.419191 -0.086052 -0.121664 -0.513439 0.405723 -0.378742 -0.477086 -0.250545 0.234315 0.248255 0.219576 0.206756 0.226496 0.272587 0.267561 0.340595 0.258456 0.251617 0.362299
chargesum: 0.00000
title: Mulliken charges with hydrogens summed into heavy atoms:
elementType: O N N N C C C C C C
charge: -0.128572 -0.016497 -0.078596 -0.086052 0.112651 -0.045609 0.405723 0.054509 -0.218630 0.001071
polarizability: 1.06399399e+02 2.77915301e+00 8.68095570e+01 4.50986114e+00 -3.08654513e+00 6.09764464e+01
1716.lowfreq: -20.9729 -11.0382 -7.7709 -0.0008 -0.0007 -0.0002 77.1962 82.7621 128.0869
frequency: 77.0781 82.7263 128.0825 163.3995 215.1090 252.1056 304.2442 310.5245 322.9324 352.2716 422.2169 567.3128 622.2221 641.7019 655.4033 742.8326 773.2261 787.0570 814.8464 839.6921 881.5749 900.9824 927.1549 960.6294 990.7380 1051.3880 1092.8659 1100.7266 1115.0789 1135.0736 1159.7880 1218.6468 1229.8488 1241.4833 1250.3820 1310.9737 1318.0012 1350.1481 1362.7984 1370.8162 1387.0287 1428.4512 1453.8066 1467.1986 1565.6478 1633.6167 2966.6753 2989.8854 3006.2958 3032.6589 3083.0093 3221.2752 3235.3880 3440.3688 3450.3964 3580.3052 3597.4960
redmass: 3.7059 4.0074 5.1153 4.2446 3.8554 1.1727 1.9907 1.4709 2.1503 3.4496 2.0373 1.7065 2.3274 3.5687 3.6875 3.3710 1.4362 2.9889 1.3979 1.2192 2.1260 4.8043 2.2158 2.1557 3.3306 2.2673 2.2160 1.7024 1.8307 1.4116 1.4373 1.3333 1.9567 1.2762 1.4196 1.5469 1.4337 2.4079 1.4711 2.4327 1.4436 2.9251 1.0967 1.0903 4.5238 1.0953 1.0566 1.0687 1.0814 1.1085 1.0957 1.0975 1.0994 1.0845 1.0443 1.0979 1.0669
irintensity: 1.9092 6.9707 5.3411 13.4219 3.9711 47.4944 58.4976 92.0851 26.0746 6.8346 10.6272 127.9023 117.6726 5.7204 24.0040 5.0525 47.2312 1.5536 2.3284 141.9145 23.5182 17.3118 20.1414 4.3835 14.1304 20.5780 22.1331 28.7401 15.2656 1.9776 24.3192 5.0825 11.3024 16.8741 8.1301 7.3252 1.8452 15.7487 11.2381 17.9298 8.0666 15.7210 6.9312 13.1878 20.2336 39.4046 41.7975 9.7152 50.0827 60.2416 14.5906 7.9574 2.1496 186.3550 1.5245 1.5215 8.6072
temp: 298.150 k
press: 1.00000 atm
elementType: 8 7 7 7 6 6 6 6 6 6 1 1 1 1 1 1 1 1 1 1 1
symmnumber: 1
zpe: 458071.6 jmol-1
zpe.correction: 0.174470 hartree
zpe.thermalcorrener: 0.184565 hartree
zpe.thermalcorrenthalpy: 0.185509 hartree
zpe.thermalcorrgfe: 0.139142 hartree
zpe.sumelectzpe: -473.912074 hartree
zpe.sumelectthermal: -473.901979 hartree
zpe.sumelectthermalent: -473.901035 hartree
zpe.sumelectthermalfe: -473.947402 hartree
dipole: -5.7314 3.7018 0.7133
dipole: 6.8601
quadrupole: -68.6923 -52.1871 -60.5098
quadrupole: -1.8950 -5.7296 -0.9385
quadrupole: -8.2293 8.2760 -0.0467 -1.8950 -5.7296 -0.9385
hfenergy: -474.0865447 hartree
pointgroup: C01 [X(C6H11N3O1)]
dipole: -2.228531 1.4973482 -0.2758055 debye
dipolederiv: -0.6256802 -0.047465 -0.0547416 -0.1385525 -0.353347 0.2014253 -0.060893 0.2612947 -0.6908919 -0.6406104 -0.1628811 -0.1168153 -0.1905517 -0.8079841 -0.081045 -0.087327 -0.0712242 -0.2173523 -0.4589297 0.1906782 -0.1421509 0.2763855 -0.348926 0.1386914 -0.1966062 0.1623203 -0.3463172 -0.4607862 0.0657565 -0.0630599 0.0430615 -0.2992767 0.0388137 -0.0975167 0.0420871 -0.315452 0.5833528 0.1599963 0.0938636 0.0399153 0.3440475 0.0403349 0.0688452 0.0123602 0.2160541 0.0685419 -0.0260085 0.018961 0.0935179 0.0684348 -0.0139094 0.0221196 0.0050045 0.1420053 0.0577957 0.0104847 0.0647972 -0.108568 0.1511519 -0.1691313 0.2157077 -0.1293903 0.0350831 0.2384267 0.0017895 0.0078849 -0.0502796 0.1499267 -0.2307134 -0.019931 -0.2176226 0.5166182 -0.0391534 -0.0102333 0.0757844 0.0648835 0.0794348 -0.1237073 0.0260525 -0.1512243 -0.1270636 0.2934854 -0.0745593 0.1983953 -0.0922204 0.0659324 -0.1499326 0.1953859 -0.1480841 0.0324232 0.0422375 -0.0164748 -0.0073222 -0.0226263 0.0236239 0.0436179 -0.0095101 0.0292424 -0.1501485 0.0470123 0.0178103 0.0010461 -0.0104722 -0.1087174 0.0193972 0.0051379 0.044277 0.0853168 -0.0303181 -0.030139 -0.0580644 -0.0226024 0.0892698 0.0433171 -0.0765559 -0.0177053 -0.1136496 -0.1471892 0.1108953 0.1118691 0.1028882 0.0093808 -0.0096693 0.0768562 0.0143143 -0.03399 -0.0523327 -0.1084439 -0.1329631 -0.1244817 -0.0016257 -0.0210236 -0.0966706 0.0165517 -0.0805987 0.1693916 -0.0159878 0.0047298 0.0384102 0.2930689 0.159616 -0.028461 0.0756371 0.07145 0.0092152 0.0277912 0.0425002 0.1885674 0.3173743 -0.0875079 0.0366469 -0.0581303 0.1136403 0.4574915 -0.0949673 -0.0515913 -0.0989227 0.2493156 0.02699 -0.0187846 0.0030459 0.2877676 0.1136672 -0.0184812 -0.0203714 -0.0319095 -0.0165268 0.0925336 -0.0166415 0.0965244 0.1366162 0.0723669 -0.0655752 -0.0074247 -0.0677633 0.0073306 0.0780758 -0.0110548 0.0787468 0.1510389 0.302015 0.0860143 0.0346733 0.1113208 0.0881116 0.003827 0.0732004 -0.0480251 0.2874503 unknown
polarizability: 105.8362534|4.3142109|83.1625268|6.180802|-9.2139383|65.1866219 unknown
InChI: InChI=1S/C6H11N3O/c7-5(3-10)1-6-2-8-4-9-6/h2,4-5,9-10H,1,3,7H2
charge 0 multiplicity 1
21 atoms
O  -1.482927 1.560243 -0.952924
N  -3.058683 -0.95385 -0.136729
N  1.18289 0.637833 -0.538744
N  2.952248 -0.217934 0.577847
C  -1.797795 -0.449263 0.436439
C  -0.620073 -1.137273 -0.326188
C  0.756619 -0.605142 -0.041394
C  -1.68027 1.094979 0.448499
C  1.869224 -1.11425 0.640159
C  2.498929 0.831517 -0.140345
H  -1.752859 -0.766079 1.497427
H  -0.661127 -2.212414 -0.086857
H  -0.831938 -1.045536 -1.409986
H  -2.612242 1.526345 0.86564
H  -0.818749 1.42065 1.06477
H  -3.196614 -0.668186 -1.112128
H  -3.891112 -0.792836 0.4386
H  0.543171 1.269897 -1.037683
H  1.960319 -2.066215 1.159542
H  3.077964 1.717719 -0.389349
H  -1.835774 2.477496 -1.054696
