program: Gaussian 09
title: 000165262
version: EM64L-G09RevD.01
frameworkgroup: C1[X(C14H12I3NO2)]
method: RPBEPBE
basis: SDD
operation: Freq
keyword: #p
keyword: freq=noraman
keyword: PBEPBE/SDD
title: #p freq=noraman PBEPBE/SDD
converged: NO YES NO NO
title: Mulliken charges:
elementType: I I I O O N C C C C C C C C C C C C C C H H H H H H H H H H H H
charge: 0.144791 0.144755 0.104294 -0.277812 -0.405742 -0.545497 -0.559114 0.532345 -0.395029 -0.364033 -0.363910 0.500229 -0.466833 -0.466811 0.341905 -0.223707 -0.349744 -0.517702 -0.288600 0.387911 0.209467 0.209453 0.225352 0.225358 0.256680 0.256673 0.271067 0.271072 0.274492 0.262803 0.262060 0.343826
chargesum: 0.00000
title: Mulliken charges with hydrogens summed into heavy atoms:
elementType: I I I O O N C C C C C C C C C C C C C C
charge: 0.144791 0.144755 0.104294 -0.277812 -0.061916 -0.003358 -0.140194 0.532345 0.055681 -0.107353 -0.107236 0.500229 -0.466833 -0.466811 0.341905 0.050785 -0.086941 -0.517702 -0.026540 0.387911
polarizability: 2.64661652e+02 1.77508012e-02 2.26316158e+02 -4.53807634e+01 -3.52552873e-02 2.40392191e+02
1716.lowfreq: -4.6023 -3.6082 -3.3513 -0.0005 -0.0004 -0.0003 10.4099 15.5338 18.8343
frequency: 9.8107 15.3784 18.8130 21.1007 40.6575 71.5170 86.2757 90.5840 113.9974 142.9611 149.6763 166.0134 179.9535 190.8439 210.4721 218.3487 234.9908 275.5559 276.0225 337.4143 340.0750 359.6676 382.3979 419.1403 439.5739 449.9535 493.6738 507.0133 512.6279 515.2343 547.0484 549.6275 634.9697 650.8219 688.5840 692.3305 693.6600 753.8704 766.0733 798.5492 819.8262 850.5329 853.2874 869.7171 890.7804 895.2396 943.3463 951.1195 974.1499 1007.1494 1028.7843 1086.0622 1105.5245 1112.1130 1155.2512 1164.2371 1196.7591 1200.0298 1225.8970 1250.5975 1259.9858 1267.6207 1291.8785 1328.5952 1344.5100 1345.4503 1376.3843 1384.6425 1409.6377 1423.5752 1459.7997 1464.4629 1475.3352 1533.3336 1575.2176 1583.1218 1612.6610 1645.5594 2984.1501 2994.6075 3035.5744 3063.7052 3151.3536 3154.9065 3164.6518 3175.5456 3184.1401 3468.0790 3479.0117 3606.9935
redmass: 12.9422 5.2372 7.3369 8.8045 41.8180 6.4829 1.7351 17.9424 6.5489 5.0378 12.5954 4.5743 4.2251 10.2680 8.0800 8.5092 9.7025 4.4569 1.1029 4.0807 6.3310 4.0357 6.2391 1.1077 3.1098 4.4015 5.2096 7.1145 5.8179 2.0776 2.7023 3.6749 4.1692 6.2531 7.1075 6.4402 4.2447 7.6020 1.1314 6.0130 1.4275 5.3668 1.4629 1.9702 5.3296 1.3490 1.2734 1.3440 4.8853 3.1617 3.9128 1.2207 4.3656 1.3513 1.6869 1.8606 1.6533 1.6796 4.5160 2.5432 1.3702 1.4124 1.6531 1.1796 1.1976 5.8178 2.6508 4.9925 3.9614 3.8374 1.0951 3.0756 1.0964 7.9817 6.9631 7.2300 7.4060 1.0926 1.0591 1.0600 1.1027 1.1066 1.0919 1.0929 1.0884 1.0921 1.0977 1.0650 1.0446 1.0988
irintensity: 0.4432 0.5403 0.2311 0.0986 0.0476 0.7065 3.0218 0.0396 0.0217 0.5714 0.0689 0.0880 3.5651 0.0659 3.1058 1.9893 0.1680 5.9014 45.1620 10.5841 0.0022 4.2157 0.6345 138.4512 0.0002 19.3148 0.0129 10.6342 6.7289 156.7876 250.8973 2.3552 16.6962 4.2588 51.1934 18.0373 15.7353 39.9267 4.2804 24.4376 29.2374 11.7002 24.1822 53.5485 9.5118 0.0133 0.3014 0.0093 76.3492 22.9417 15.8827 2.5449 62.4414 13.2576 22.7388 323.3958 6.4124 55.5777 108.3607 44.5213 0.0792 5.3318 17.3554 0.7840 16.6186 4.7844 36.8119 32.7829 7.3479 173.1634 6.2536 308.2584 10.2049 72.3154 36.8837 26.9193 15.1746 42.7359 8.3906 69.1064 0.0057 41.4053 0.9464 6.9057 3.1816 0.7380 2.2297 49.8968 5.6664 1.8941
temp: 298.150 k
press: 1.00000 atm
elementType: 53 53 53 8 8 7 6 6 6 6 6 6 6 6 6 6 6 6 6 6 1 1 1 1 1 1 1 1 1 1 1 1
symmnumber: 1
zpe: 591375.0 jmol-1
zpe.correction: 0.225243 hartree
zpe.thermalcorrener: 0.246419 hartree
zpe.thermalcorrenthalpy: 0.247364 hartree
zpe.thermalcorrgfe: 0.167692 hartree
zpe.sumelectzpe: -778.937385 hartree
zpe.sumelectthermal: -778.916209 hartree
zpe.sumelectthermalent: -778.915265 hartree
zpe.sumelectthermalfe: -778.994937 hartree
dipole: -3.3588 -0.0043 2.1450
dipole: 3.9853
quadrupole: -140.3723 -157.7601 -162.7696
quadrupole: 0.0145 -8.0403 0.0089
quadrupole: 13.2617 -4.1261 -9.1356 0.0145 -8.0403 0.0089
hfenergy: -779.1626283 hartree
pointgroup: C01 [X(C14H12I3N1O2)]
dipole: -1.5480231 0.2490901 -0.0002638 debye
polarizability: 293.9323682|-22.1866433|211.1217351|0.0939127|0.0625298|226.3158979 unknown
InChI: InChI=1S/C14H12I3NO2/c15-10-7-9(1-2-13(10)19)20-14-11(16)5-8(3-4-18)6-12(14)17/h1-2,5-7,19H,3-4,18H2
charge 0 multiplicity 1
32 atoms
I  -0.148341 -1.352566 3.085126
I  -0.150096 -1.367781 -3.079545
I  2.663792 3.599548 -0.008292
O  0.871432 -1.696739 0.003316
O  5.400165 1.668782 -0.003642
N  -6.049598 2.229039 -0.003041
C  -4.626602 0.091635 0.000593
C  -3.195414 -0.410885 0.001329
C  -4.697992 1.663528 -0.002282
C  -2.502438 -0.621015 -1.218411
C  -2.501752 -0.615132 1.221671
C  -0.448008 -1.209197 0.002502
C  -1.148875 -1.010361 1.220138
C  -1.149558 -1.016244 -1.215694
C  1.955351 -0.769536 0.001272
C  1.773007 0.628084 -0.001851
C  3.247354 -1.338799 0.00268
C  2.915625 1.454929 -0.003533
C  4.371022 -0.497606 0.000953
C  4.225385 0.913725 -0.002165
H  -5.169155 -0.279777 -0.889725
H  -5.168794 -0.276516 0.892492
H  -4.155346 2.041893 -0.889157
H  -4.154968 2.045189 0.882954
H  -3.026402 -0.485857 -2.169639
H  -3.025189 -0.475348 2.172523
H  -6.593775 2.075201 0.849371
H  -6.594147 2.072196 -0.854679
H  0.769522 1.059512 -0.002974
H  3.352116 -2.426921 0.005102
H  5.386049 -0.904385 0.001978
H  5.19103 2.641807 -0.005771
