program: Gaussian 09
title: 000165242
version: EM64L-G09RevD.01
frameworkgroup: C1[X(C6H11FO5)]
method: RPBEPBE
basis: SDD
operation: Freq
keyword: #p
keyword: freq=noraman
keyword: PBEPBE/SDD
title: #p freq=noraman PBEPBE/SDD
converged: YES YES NO NO
title: Mulliken charges:
elementType: F O O O O O C C C C C C H H H H H H H H H H H
charge: -0.247036 -0.447480 -0.483334 -0.495181 -0.421595 -0.219830 -0.123590 -0.189449 -0.126371 -0.131812 -0.248060 -0.067219 0.246220 0.264677 0.271982 0.279469 0.212800 0.231674 0.364843 0.380922 0.211868 0.376410 0.360094
chargesum: 0.00000
title: Mulliken charges with hydrogens summed into heavy atoms:
elementType: F O O O O O C C C C C C
charge: -0.247036 -0.082637 -0.102412 -0.118771 -0.061501 -0.219830 0.122630 0.075228 0.145611 0.147657 0.196413 0.144649
polarizability: 9.34550498e+01 -4.59031926e-01 7.76193474e+01 -2.53940837e+00 -1.18664073e+00 7.09611270e+01
1716.lowfreq: -15.8549 -6.6432 -0.0009 -0.0008 -0.0008 3.7230 49.2658 50.0206 72.1319
frequency: 48.6890 49.9433 72.0901 92.2529 124.1643 132.2074 183.8856 212.7681 224.0495 255.3545 281.9847 301.8412 342.2852 416.5211 427.6388 463.2675 510.3705 519.3685 572.0652 576.6236 647.4810 693.2449 760.2720 822.0138 834.9438 896.2486 914.4037 917.8152 968.2292 981.8473 1031.8774 1038.2425 1060.4528 1079.2189 1106.6688 1156.8128 1188.7628 1199.9998 1221.7167 1255.4401 1271.4741 1303.4234 1325.7146 1338.4804 1346.9898 1348.5645 1368.5353 1373.6920 1386.3945 1411.3902 1453.5286 1606.2029 2947.0451 3022.6202 3029.3521 3034.1416 3051.9186 3072.4864 3112.0282 3417.6480 3444.5507 3496.8491 3571.2178
redmass: 5.5502 7.7443 5.9182 5.9604 4.4214 4.0440 6.6539 6.4122 5.2713 5.1624 5.3995 5.1422 3.2493 4.4805 1.1477 4.2362 2.1318 1.3118 2.2780 1.4480 1.1293 3.6990 3.8361 4.0677 3.6260 2.3405 5.0510 3.5347 4.1180 2.8165 3.1564 1.9001 2.6784 2.1120 2.6768 1.0934 1.1525 1.2866 1.2471 1.3858 1.2751 1.3554 1.4754 1.2183 1.2145 1.2969 1.2594 1.3273 1.3713 1.5874 1.0956 7.9977 1.0886 1.0840 1.0576 1.0845 1.0858 1.0855 1.1111 1.0647 1.0644 1.0652 1.0659
irintensity: 0.5288 1.4817 1.0820 11.7091 5.7846 15.5526 16.1612 3.7372 5.9552 5.9753 13.7785 0.7844 24.6943 12.6748 131.8062 15.7855 35.5225 62.7160 78.5144 101.6316 307.7520 41.1561 12.7763 17.5525 13.3044 31.8886 75.5120 20.4025 47.7054 14.4658 10.6170 39.0443 85.8837 7.6259 10.9765 34.9244 10.4315 24.2464 39.1354 35.2278 27.1297 64.5065 1.4256 12.9562 1.6946 4.1912 40.5068 41.3226 24.2235 9.8918 8.2188 103.5074 90.2279 9.3461 15.1620 8.2394 22.4347 8.6690 20.3899 25.1737 42.4126 43.9971 28.2366
temp: 298.150 k
press: 1.00000 atm
elementType: 9 8 8 8 8 8 6 6 6 6 6 6 1 1 1 1 1 1 1 1 1 1 1
symmnumber: 1
zpe: 462460.2 jmol-1
zpe.correction: 0.176142 hartree
zpe.thermalcorrener: 0.189568 hartree
zpe.thermalcorrenthalpy: 0.190512 hartree
zpe.thermalcorrgfe: 0.135566 hartree
zpe.sumelectzpe: -710.176076 hartree
zpe.sumelectthermal: -710.162650 hartree
zpe.sumelectthermalent: -710.161706 hartree
zpe.sumelectthermalfe: -710.216652 hartree
dipole: 0.4094 -0.1485 0.2160
dipole: 0.4861
quadrupole: -75.9307 -77.5819 -67.3282
quadrupole: -0.8305 -0.2381 -0.0691
quadrupole: -2.3171 -3.9683 6.2854 -0.8305 -0.2381 -0.0691
hfenergy: -710.352218 hartree
pointgroup: C01 [X(C6H11F1O5)]
dipole: -0.1658831 0.0566636 0.0764941 debye
dipolederiv: -0.7973627 0.1247459 -0.0813644 0.2209706 -0.3923116 0.0104695 -0.0475881 -0.0107586 -0.2972633 -0.7039596 -0.1005648 -0.0213377 -0.1273037 -0.3988622 0.198738 0.000328 0.1981717 -0.5767594 -0.6438142 0.104718 0.1213218 0.0762467 -0.5642472 0.2147332 0.1382847 0.2288248 -0.5499856 -0.4704347 -0.0252766 0.1368868 0.0073532 -0.6451631 -0.1758736 0.1539243 -0.1582374 -0.6213602 -0.7218313 -0.0783548 0.0293798 -0.0129534 -0.3777903 -0.2006321 0.0333289 -0.198673 -0.4963256 -0.5647624 -0.039588 -0.0710468 -0.1633189 -0.8425033 -0.0685367 -0.0646103 0.0834043 -0.2841492 0.3850411 0.0591852 -0.0383813 0.1149303 0.2622815 -0.1132551 -0.1138392 -0.0804143 0.4169735 0.2280006 -0.0038331 -0.0880325 0.0459883 0.2769435 -0.1649976 -0.1774338 -0.1409608 0.3126585 0.10486 0.0314347 -0.1476032 -0.129035 0.2706942 0.1650039 -0.1031186 0.136266 0.4055404 0.1076808 0.0033365 -0.0660146 -0.1466138 0.0712847 0.0824009 -0.0970206 -0.015385 0.325493 0.7026149 -0.2000179 0.0530346 -0.1307596 0.37054 -0.0503576 0.0621034 -0.048527 0.3049156 0.7455491 0.0832448 0.1729668 0.1591408 0.9297629 0.0310094 0.2169221 -0.0004985 0.077048 0.1085013 0.009058 0.0290202 -0.0160836 0.00761 -0.0712302 0.0030175 -0.0551513 -0.0527694 0.0786234 0.0048711 0.0354455 0.0203559 -0.0077593 -0.0559867 0.0178985 -0.0373585 -0.0809506 0.1302105 -0.0010735 0.0092145 -0.0266829 -0.0319843 0.0619564 0.0082617 0.023749 -0.0617495 0.1433725 -0.0010645 -0.0008992 -0.0052678 0.0172271 0.0743545 -0.0218921 0.0271771 -0.0056852 0.0366155 0.0330561 -0.0024957 0.0466306 0.0462227 -0.0454622 0.0207824 -0.0904497 -0.0960908 0.0321234 0.0008924 0.0254588 0.0024213 -0.029 0.0528053 0.0492136 0.1170631 0.0179732 0.3918816 0.0009748 0.0651437 0.0004297 0.2254218 -0.105177 0.0660836 -0.0797223 0.2972293 0.3320564 -0.1494733 0.0075502 -0.0836048 0.2899757 -0.0456681 0.0134488 -0.0918462 0.2770187 -0.1987182 0.0781027 -0.0768327 0.1206203 -0.0267521 0.0486941 -0.0396604 0.0481578 0.1150138 0.1702586 0.094922 -0.0262143 0.0825799 0.3712469 0.0470535 -0.0841841 0.0488997 0.3120417 0.4034933 -0.0292957 -0.0652001 -0.056044 0.1771625 0.1099582 -0.0342504 0.0962692 0.2611833 unknown
polarizability: 93.2593025|0.1759268|77.711033|3.2965837|0.9658639|71.0651887 unknown
InChI: InChI=1S/C6H11FO5/c7-1-3(9)5(11)6(12)4(10)2-8/h2-6,9-12H,1H2
charge 0 multiplicity 1
23 atoms
F  -4.169652 0.260709 -0.527359
O  -0.704884 -1.395584 1.394938
O  0.863152 1.01564 -0.986343
O  -2.087074 0.861455 1.224836
O  2.27799 -1.348087 -0.785326
O  3.263421 1.506865 0.52795
C  -0.538027 -0.617017 0.163404
C  0.72498 0.261051 0.279636
C  -1.796665 0.239478 -0.08485
C  1.990372 -0.597045 0.458881
C  -2.980523 -0.615191 -0.528845
C  3.242781 0.255697 0.682067
H  -0.397557 -1.352332 -0.64911
H  0.607845 0.953606 1.136069
H  -1.576879 1.01787 -0.838755
H  1.849171 -1.350729 1.251037
H  -2.86107 -0.991623 -1.559572
H  -3.189277 -1.433988 0.18092
H  -1.190991 -0.790765 2.023869
H  1.510701 1.75063 -0.807503
H  4.174831 -0.315022 0.899363
H  -2.996201 1.253427 1.18992
H  2.070157 -0.704345 -1.523427
