program: Gaussian 09
title: 000012968
version: EM64L-G09RevD.01
frameworkgroup: C1[X(C9H19NOS)]
method: RPBEPBE
basis: SDD
operation: Freq
keyword: #p
keyword: freq=noraman
keyword: PBEPBE/SDD
title: #p freq=noraman PBEPBE/SDD
converged: YES YES NO NO
title: Mulliken charges:
elementType: S O N C C C C C C C C C H H H H H H H H H H H H H H H H H H H
charge: 0.092721 -0.248783 -0.078309 -0.381086 -0.360519 -0.335700 -0.343338 -0.049574 -0.677156 -0.680098 -0.586979 -0.623619 0.213719 0.239731 0.200878 0.247293 0.196371 0.231138 0.192717 0.235558 0.206068 0.223956 0.217442 0.205243 0.222743 0.218809 0.290731 0.244671 0.219706 0.252456 0.213211
chargesum: 0.00000
title: Mulliken charges with hydrogens summed into heavy atoms:
elementType: S O N C C C C C C C C C
charge: 0.092721 -0.248783 -0.078309 0.072363 0.087652 0.091809 0.084937 -0.049574 -0.029690 -0.033304 -0.051578 0.061755
polarizability: 1.61452990e+02 -5.29063707e+00 1.30881316e+02 -3.52804570e+00 -5.67344535e+00 9.49186081e+01
1716.lowfreq: -9.7129 -5.9244 -0.0024 -0.0005 0.0019 13.0942 33.8075 41.7427 47.6466
frequency: 33.5420 41.6143 47.5454 57.3956 73.2448 75.2477 89.9397 105.1392 182.4126 214.0749 220.6305 237.5353 244.5062 261.7359 282.4316 309.3500 340.6085 352.5257 399.2830 464.2968 533.7714 618.2294 624.1159 686.8291 743.9183 748.5148 753.1405 850.5539 867.0852 882.0770 889.1288 935.0980 983.7731 1048.0807 1048.3138 1058.9578 1070.4890 1091.2706 1104.1068 1110.6510 1117.0270 1203.1480 1215.8268 1254.4780 1261.6667 1280.2349 1287.0672 1290.5828 1300.0037 1304.2956 1355.7301 1361.7181 1382.1891 1388.8220 1391.3060 1392.7532 1428.2474 1450.0327 1464.6909 1472.0511 1473.0873 1476.9552 1479.1726 1479.2823 1479.9873 1485.4930 1489.0518 1620.5598 2975.7604 2976.1941 2981.0798 2983.1299 2984.9421 2991.9697 2994.6860 3032.9706 3034.7170 3040.2145 3054.3990 3065.8913 3074.1712 3076.2560 3079.6805 3080.7628 3081.3176 3092.7329 3118.8384
redmass: 3.0278 2.8384 3.2535 3.2302 3.9022 1.9461 1.7508 4.9978 1.6858 1.2890 1.1265 2.3455 2.2728 1.9067 2.3594 3.1554 3.4626 3.3346 4.1918 5.8152 4.2273 5.3950 10.8798 3.7324 1.1402 1.0969 1.1930 1.8590 1.2617 1.4063 1.7240 2.9706 1.7328 2.9419 2.9178 1.3246 2.3516 1.7269 2.1276 2.2158 1.9994 2.5603 1.6441 1.2008 1.3801 1.2135 1.1981 1.2847 1.3007 1.2550 1.3639 1.3919 2.0377 1.2103 1.2098 1.2111 1.1013 1.0869 1.0409 1.0712 1.0598 1.0597 1.0470 1.0526 1.0482 1.0697 1.0872 8.0833 1.0362 1.0360 1.0372 1.0610 1.0622 1.0630 1.0631 1.0592 1.0972 1.0962 1.1025 1.1005 1.0960 1.1022 1.0999 1.0992 1.1024 1.1012 1.1058
irintensity: 0.1264 0.1700 1.5082 0.9677 0.7667 0.1917 0.0659 1.6855 4.1260 0.5566 0.2689 0.5399 0.8643 0.5615 7.1736 2.0809 9.7132 10.9266 4.0790 6.4147 10.5453 8.5926 9.6007 26.4358 8.9474 15.1066 7.0089 10.3660 1.8449 18.2623 19.3506 21.4398 32.6662 0.0768 0.5584 1.3892 11.3506 44.5165 31.4138 1.9517 128.0674 36.3615 57.3572 7.3777 11.0677 23.2373 6.4593 4.2329 0.0319 11.7807 0.7561 7.3081 91.6873 20.1131 16.2633 15.1296 30.6639 18.5600 13.2730 1.4004 4.4783 9.3116 7.4915 3.3676 15.4172 15.5544 23.7948 276.3054 39.8450 33.1898 37.0603 2.8152 8.1763 70.4876 33.4035 21.5545 1.9696 2.3878 2.4598 9.2135 36.0442 66.7777 44.5948 40.4734 67.2538 8.6452 15.3790
temp: 298.150 k
press: 1.00000 atm
elementType: 16 8 7 6 6 6 6 6 6 6 6 6 1 1 1 1 1 1 1 1 1 1 1 1 1 1 1 1 1 1 1
symmnumber: 1
zpe: 705715.0 jmol-1
zpe.correction: 0.268793 hartree
zpe.thermalcorrener: 0.284997 hartree
zpe.thermalcorrenthalpy: 0.285941 hartree
zpe.thermalcorrgfe: 0.223214 hartree
zpe.sumelectzpe: -881.414034 hartree
zpe.sumelectthermal: -881.397829 hartree
zpe.sumelectthermalent: -881.396885 hartree
zpe.sumelectthermalfe: -881.459613 hartree
dipole: -1.7946 1.8062 -0.0746
dipole: 2.5472
quadrupole: -73.7559 -85.1946 -83.9544
quadrupole: -1.6292 -0.4886 1.5067
quadrupole: 7.2124 -4.2263 -2.9861 -1.6292 -0.4886 1.5067
hfenergy: -881.6828262 hartree
pointgroup: C01[X(C9H19N1O1S1)]
dipole: -0.7041104 0.7126699 -0.0255531 debye
polarizability: 160.543476|-6.3347175|130.0520215|-7.9651878|-7.5578766|96.6574167 unknown
InChI: InChI=1S/C9H19NOS/c1-4-7-10(8-5-2)9(11)12-6-3/h4-8H2,1-3H3
charge 0 multiplicity 1
31 atoms
S  2.04713 0.355507 -1.066236
O  0.83104 -1.749193 0.258308
N  -0.546338 0.095018 -0.13881
C  -0.758579 1.452707 -0.687724
C  -1.690626 -0.566514 0.539975
C  -0.491531 2.578455 0.340043
C  -2.566066 -1.397746 -0.426208
C  0.647077 -0.589799 -0.206121
C  -0.775486 3.973693 -0.255395
C  -3.770769 -2.032178 0.30108
C  3.396606 -0.954232 -0.826917
C  4.114051 -0.815553 0.521579
H  -1.806238 1.511257 -1.041976
H  -0.114847 1.594225 -1.575526
H  -2.297988 0.221526 1.026158
H  -1.286626 -1.224424 1.329376
H  -1.123624 2.413682 1.234939
H  0.561211 2.512902 0.67212
H  -2.92263 -0.751584 -1.252988
H  -1.936815 -2.185917 -0.879129
H  -1.82837 4.065795 -0.583823
H  -0.584591 4.767939 0.488097
H  -0.129792 4.171767 -1.131331
H  -4.422073 -1.259799 0.752788
H  -4.387587 -2.625649 -0.39719
H  -3.435765 -2.707449 1.110366
H  2.885299 -1.927282 -0.908722
H  4.072768 -0.81317 -1.686813
H  4.574627 0.181354 0.636489
H  3.403271 -0.97404 1.350137
H  4.913262 -1.577601 0.605352
