program: Gaussian 09
title: 000165184
version: EM64L-G09RevD.01
frameworkgroup: C1[X(C14H10N2S)]
method: RPBEPBE
basis: SDD
operation: Freq
keyword: #p
keyword: freq=noraman
keyword: PBEPBE/SDD
title: #p freq=noraman PBEPBE/SDD
converged: YES YES NO NO
title: Mulliken charges:
elementType: S N N C C C C C C C C C C C C C C H H H H H H H H H H
charge: 0.366020 -0.058400 -0.424186 0.521787 0.299164 -0.409567 0.084758 -0.374410 -0.356427 -0.369825 -0.335391 -0.221419 -0.232510 -0.228444 -0.229283 -0.231591 -0.232187 0.273122 0.230486 0.265502 0.270653 0.234613 0.233909 0.228256 0.229394 0.235988 0.229987
chargesum: 0.00000
title: Mulliken charges with hydrogens summed into heavy atoms:
elementType: S N N C C C C C C C C C C C C C C
charge: 0.366020 -0.058400 -0.424186 0.521787 0.299164 -0.409567 0.084758 -0.101288 -0.125941 -0.104323 -0.064737 0.013195 0.001399 -0.000188 0.000111 0.004396 -0.002200
polarizability: 3.20533751e+02 1.58432059e-01 1.95397185e+02 -4.18592141e-02 1.21113557e-01 6.68963739e+01
1716.lowfreq: -9.9568 -1.2511 -0.0012 0.0006 0.0012 6.9816 29.1251 38.3800 68.4170
frequency: 29.0824 38.3777 68.4170 79.7322 116.5251 164.3822 242.0589 248.5523 265.0819 302.7862 354.8989 398.2371 404.6630 448.6855 470.5195 483.3398 598.8005 601.4896 611.7677 614.9008 646.5304 657.0023 692.7122 698.3508 703.8165 709.2866 779.9810 788.4460 853.4560 855.2290 864.3919 924.9030 938.5061 948.1384 986.4510 988.5348 989.6395 994.9650 1005.5137 1006.2721 1020.8764 1026.3936 1069.1217 1081.2995 1093.9446 1172.7630 1175.3339 1183.3905 1190.9286 1227.2913 1259.9049 1320.4649 1322.0758 1382.5469 1384.3292 1394.1210 1435.8819 1442.1947 1462.2150 1493.1533 1520.5172 1583.7011 1588.8465 1610.5053 1614.7554 3121.4052 3127.5910 3135.1041 3139.9506 3149.0945 3154.0082 3163.4758 3165.3375 3172.8526 3174.0952
redmass: 3.7101 4.4418 5.4191 7.3386 5.5819 5.6707 5.5528 6.5731 7.4029 8.6277 7.3222 2.8065 2.8490 4.3305 8.9482 3.5716 5.2362 10.2342 6.9000 6.6451 10.3597 7.0281 1.8014 4.4280 1.8150 9.1768 1.8401 2.0705 1.2545 8.8613 1.2457 8.3888 1.4310 1.4256 1.3838 6.2455 6.2426 1.3798 1.3323 1.3302 2.7112 2.1286 2.3508 1.6547 1.9207 1.0549 1.0573 1.1152 1.1189 4.1535 5.4088 1.3689 1.3737 7.0761 7.9953 4.8198 2.3734 2.3785 2.6134 2.9243 5.8636 6.0256 6.3971 5.9974 6.1074 1.0885 1.0852 1.0870 1.0891 1.0922 1.0938 1.0964 1.0958 1.0998 1.1000
irintensity: 0.0036 0.4270 0.5287 1.1711 0.3680 1.3350 0.0356 0.5822 2.1225 0.6388 2.8053 0.0000 0.0156 2.3284 1.5286 7.1157 0.5993 3.6012 3.7778 0.8106 10.6575 13.8019 54.4851 2.3390 92.5753 11.6860 26.9716 59.5869 0.1535 3.4307 0.0005 36.2717 3.6945 7.1758 0.3352 1.2791 0.0123 0.0033 0.0012 1.0750 21.2192 7.8406 31.2990 0.2561 13.9752 0.1103 0.8585 24.0872 5.2470 30.1083 23.7540 2.6940 16.1924 37.9309 11.1573 102.8375 28.8617 12.5360 99.0087 4.7248 54.9309 0.7080 1.6053 5.0958 0.9430 7.5278 0.0164 0.6904 13.9503 16.7151 25.6480 19.5854 12.3625 20.1225 16.9379
temp: 298.150 k
press: 1.00000 atm
elementType: 16 7 7 6 6 6 6 6 6 6 6 6 6 6 6 6 6 1 1 1 1 1 1 1 1 1 1
symmnumber: 1
zpe: 527157.8 jmol-1
zpe.correction: 0.200784 hartree
zpe.thermalcorrener: 0.214235 hartree
zpe.thermalcorrenthalpy: 0.215179 hartree
zpe.thermalcorrgfe: 0.158657 hartree
zpe.sumelectzpe: -1045.893311 hartree
zpe.sumelectthermal: -1045.879860 hartree
zpe.sumelectthermalent: -1045.878916 hartree
zpe.sumelectthermalfe: -1045.935438 hartree
dipole: -2.2651 -1.7478 0.0051
dipole: 2.8611
quadrupole: -78.5459 -98.5417 -112.3566
quadrupole: -2.1199 -0.0106 0.0676
quadrupole: 17.9355 -2.0603 -15.8752 -2.1199 -0.0106 0.0676
hfenergy: -1046.0940948 hartree
pointgroup: C01 [X(C14H10N2S1)]
dipole: 0.9025493 -0.6700999 -0.0584594 debye
polarizability: 320.5040449|1.93148|194.5428658|0.1135014|10.6234248|67.7803991 unknown
InChI: InChI=1S/C14H10N2S/c1-3-7-11(8-4-1)13-15-14(17-16-13)12-9-5-2-6-10-12/h1-10H
charge 0 multiplicity 1
27 atoms
S  0.755752 2.460677 0.269481
N  0.014629 -0.064444 0.053214
N  -0.996862 2.08598 0.237027
C  2.493813 0.117499 0.068238
C  -2.480477 0.129351 0.068946
C  1.130675 0.653686 0.11467
C  -1.135934 0.740316 0.121822
C  2.68146 -1.289606 -0.045086
C  3.632779 0.966327 0.132573
C  -2.611733 -1.279935 -0.048264
C  -3.64555 0.940258 0.134041
C  3.981291 -1.829495 -0.092394
C  4.93136 0.421064 0.084856
C  -3.892864 -1.86892 -0.099411
C  -4.92196 0.345818 0.082507
C  5.110701 -0.978186 -0.027787
C  -5.051242 -1.059804 -0.034408
H  1.797345 -1.932439 -0.093737
H  3.505112 2.052757 0.218851
H  -1.70546 -1.890988 -0.097151
H  -3.531281 2.025122 0.223727
H  4.1172 -2.912862 -0.17934
H  5.802095 1.083326 0.134847
H  -3.988087 -2.956655 -0.18957
H  -5.817106 0.975467 0.133009
H  6.120797 -1.400488 -0.064744
H  -6.045553 -1.518624 -0.074317
