program: Gaussian 09
title: 000165177
version: EM64L-G09RevD.01
frameworkgroup: C1[X(C10H19NO)]
method: RPBEPBE
basis: SDD
operation: Freq
keyword: #p
keyword: freq=noraman
keyword: PBEPBE/SDD
title: #p freq=noraman PBEPBE/SDD
converged: YES YES NO NO
title: Mulliken charges:
elementType: O N C C C C C C C C C C H H H H H H H H H H H H H H H H H H H
charge: -0.448079 -0.096897 -0.306935 -0.304843 -0.399906 0.169823 -0.689483 -0.689352 -0.697979 -0.687931 -0.039370 -0.034241 0.175929 0.228471 0.174699 0.210815 0.235125 0.215046 0.231357 0.206605 0.210822 0.232895 0.209228 0.212872 0.215772 0.233461 0.218737 0.229303 0.240864 0.206590 0.336601
chargesum: 0.00000
title: Mulliken charges with hydrogens summed into heavy atoms:
elementType: O N C C C C C C C C C C
charge: -0.111478 -0.096897 0.097465 0.080672 0.050265 0.169823 -0.040699 -0.034357 -0.030009 -0.011173 -0.039370 -0.034241
polarizability: 1.57257896e+02 -5.82982991e+00 1.11098653e+02 -1.53868059e+00 5.23342357e-01 9.84727784e+01
1716.lowfreq: -3.9600 -1.8874 -0.0010 -0.0008 -0.0005 8.8610 14.1494 34.8465 40.1742
frequency: 10.9515 34.7944 40.1319 58.8864 85.1877 112.2357 139.9370 188.6859 194.1362 216.1764 227.4731 246.5819 277.7037 284.4394 307.3655 326.2476 331.9916 350.9973 381.2704 411.3148 462.6134 507.2331 538.2189 545.3687 666.6788 735.3209 794.0940 802.3781 816.5754 901.9021 910.7717 925.2535 969.5755 987.3088 996.8664 1044.4748 1074.9869 1079.3930 1089.8775 1105.7638 1116.4028 1151.9377 1163.5688 1193.3127 1235.0744 1244.4169 1277.4508 1285.8416 1320.6911 1354.7727 1362.2122 1369.6361 1373.3452 1386.6388 1388.5391 1388.7314 1451.2410 1453.6601 1458.0764 1465.6357 1468.6007 1469.3248 1472.3846 1475.1685 1479.8834 1486.1356 1492.0161 2267.6099 2814.7057 2834.2158 2848.9260 2984.1136 2984.3020 2984.8822 3000.4707 3025.2140 3028.5117 3044.8022 3074.5084 3077.6362 3084.3291 3092.4776 3093.8189 3095.1075 3104.6531 3114.2525 3545.1578
redmass: 3.1972 2.8598 3.3063 2.1010 1.8705 3.3238 2.4466 1.4817 1.0496 1.4456 2.2212 1.1299 1.8965 2.0724 1.3779 2.4309 2.7797 2.7102 3.2191 3.0097 2.6714 3.4738 5.8788 4.7312 4.2501 3.0856 1.1770 1.1759 2.9942 2.2700 2.0459 1.5318 2.1974 1.7729 1.3092 2.5426 1.9262 2.3656 2.0500 1.7145 1.8806 2.2858 1.9171 2.3082 2.8806 1.2715 1.1492 1.1890 1.9115 1.4055 1.3189 1.2168 1.3909 1.2290 1.2216 1.2174 1.0512 1.0776 1.0490 1.0556 1.0557 1.0586 1.0522 1.0649 1.0534 1.0555 1.0708 11.8698 1.0715 1.0723 1.0705 1.0356 1.0348 1.0361 1.0347 1.0832 1.0875 1.0874 1.0985 1.0970 1.1000 1.1002 1.1002 1.1010 1.1003 1.1009 1.0660
irintensity: 0.6887 0.0878 0.0277 0.9835 0.8490 1.0223 0.7879 1.6015 3.1847 0.6877 0.3300 11.8930 6.7178 12.3477 100.3080 17.4346 8.9062 13.6552 5.9805 4.1654 6.5754 1.2571 12.1262 7.3926 5.6575 11.9139 8.3197 4.1194 20.5254 20.8164 15.1716 2.3987 11.0529 3.2909 1.9369 20.8638 18.8790 9.5962 16.2148 57.7814 26.9716 38.4024 21.7989 24.8577 57.4929 14.8327 16.6525 19.9464 100.9572 25.4796 6.8115 23.5751 4.0108 20.6643 36.8038 2.5713 4.9167 4.2795 2.9648 5.1988 4.1273 8.3505 7.0068 4.8511 10.9778 10.7986 13.5100 2.3340 55.9257 49.7027 211.3401 14.5528 35.5289 26.3436 17.6765 12.1128 8.6722 7.5571 28.2318 93.9607 26.1198 35.6093 37.9571 12.1653 43.7884 22.7132 7.4135
temp: 298.150 k
press: 1.00000 atm
elementType: 8 7 6 6 6 6 6 6 6 6 6 6 1 1 1 1 1 1 1 1 1 1 1 1 1 1 1 1 1 1 1
symmnumber: 1
zpe: 706188.9 jmol-1
zpe.correction: 0.268973 hartree
zpe.thermalcorrener: 0.285142 hartree
zpe.thermalcorrenthalpy: 0.286086 hartree
zpe.thermalcorrgfe: 0.223521 hartree
zpe.sumelectzpe: -521.370415 hartree
zpe.sumelectthermal: -521.354246 hartree
zpe.sumelectthermalent: -521.353302 hartree
zpe.sumelectthermalfe: -521.415867 hartree
dipole: 2.0990 1.1633 -0.7746
dipole: 2.5217
quadrupole: -76.9995 -74.9306 -73.5824
quadrupole: -6.7592 0.0959 0.4026
quadrupole: -1.8287 0.2402 1.5884 -6.7592 0.0959 0.4026
hfenergy: -521.6393877 hartree
pointgroup: C01 [X(C10H19N1O1)]
dipole: 0.8364257 0.4903944 -0.2103165 debye
polarizability: 156.9181022|-6.5054933|110.6392792|-3.1076558|3.1530299|99.2719454 unknown
InChI: InChI=1S/C10H19NO/c1-5-11(6-2)9-7-8-10(3,4)12/h12H,5-6,9H2,1-4H3
charge 0 multiplicity 1
31 atoms
O  -3.434064 -1.080852 0.959293
N  2.100798 -0.000129 -0.017755
C  1.992525 1.472322 -0.222343
C  3.475434 -0.517928 -0.262011
C  1.100755 -0.741242 -0.84082
C  -2.895695 0.049794 0.143256
C  2.682487 2.28901 0.885781
C  3.719454 -1.915866 0.338948
C  -2.99451 1.362459 0.962494
C  -3.812953 0.084041 -1.095946
C  -0.298956 -0.437408 -0.492317
C  -1.484753 -0.218265 -0.226323
H  2.392417 1.774568 -1.225569
H  0.914549 1.71719 -0.22107
H  3.718166 -0.528177 -1.357565
H  4.18066 0.188369 0.209471
H  1.267676 -1.823989 -0.692007
H  1.245456 -0.54739 -1.937625
H  2.290462 1.989707 1.873319
H  3.778921 2.151412 0.895036
H  2.486725 3.367474 0.73962
H  3.468302 -1.913501 1.413816
H  3.118021 -2.701873 -0.152716
H  4.782473 -2.198183 0.22543
H  -2.680061 2.231287 0.357229
H  -4.040905 1.507244 1.282722
H  -2.350922 1.317616 1.859502
H  -4.857233 0.22673 -0.768319
H  -3.743692 -0.869454 -1.643959
H  -3.526748 0.909593 -1.769496
H  -2.79619 -1.256958 1.698926
