program: Gaussian 09
title: 000165181
version: EM64L-G09RevD.01
frameworkgroup: C1[X(C19H21NO4)]
method: RPBEPBE
basis: SDD
operation: Freq
keyword: #p
keyword: freq=noraman
keyword: PBEPBE/SDD
title: #p freq=noraman PBEPBE/SDD
converged: YES YES NO NO
title: Mulliken charges:
elementType: O O O O N C C C C C C C C C C C C C C C C C C C H H H H H H H H H H H H H H H H H H H H H
charge: -0.459525 -0.224193 -0.335930 -0.212214 -0.095086 0.135141 -0.132483 0.454188 -0.544706 0.135358 -0.624119 -0.422477 0.384750 -0.437863 -0.591284 -0.062753 -0.683528 0.156232 -0.447495 0.071449 0.213951 -0.360269 -0.540053 -0.520734 0.218567 0.250446 0.243591 0.242237 0.250921 0.250348 0.205841 0.294071 0.280243 0.182501 0.233711 0.236009 0.236403 0.242893 0.386653 0.248050 0.217628 0.222066 0.227399 0.229987 0.244079
chargesum: 0.00000
title: Mulliken charges with hydrogens summed into heavy atoms:
elementType: O O O O N C C C C C C C C C C C C C C C C C C C
charge: -0.072872 -0.224193 -0.335930 -0.212214 -0.095086 0.135141 0.086084 0.454188 -0.050669 0.135358 -0.130961 0.033711 0.384750 -0.143792 -0.311041 -0.062753 -0.031306 0.156232 -0.211092 0.071449 0.213951 -0.117376 0.147690 0.180731
polarizability: 2.67653493e+02 2.06554088e+00 2.38446356e+02 -9.24748741e+00 1.01516885e+01 1.83527899e+02
1716.lowfreq: -6.0400 0.0002 0.0005 0.0007 4.5809 12.4895 35.4834 48.9249 63.2016
frequency: 35.4722 48.9188 63.1991 80.1402 98.1815 108.5223 133.5924 142.3431 150.5835 182.6375 192.5290 196.7938 222.8827 235.8345 237.9821 238.7561 270.1888 271.3789 295.4406 315.0789 321.7452 345.8293 364.8515 378.4394 407.4024 415.4380 432.7893 448.9454 491.0907 500.2919 511.0203 516.6533 527.7566 536.0844 544.1908 570.9440 609.8527 624.3913 627.3274 677.0140 688.1498 702.0942 723.1123 727.6977 752.2980 763.8776 788.1951 801.1691 833.5016 855.3461 865.6790 889.1180 901.7412 909.4095 914.9344 929.5989 954.9816 960.2559 992.9964 1008.4675 1038.4426 1086.0308 1104.6415 1114.3738 1116.2609 1117.5467 1124.3785 1137.1578 1140.0468 1144.8018 1152.2057 1163.6465 1165.2857 1170.9473 1185.3311 1199.9431 1215.7769 1222.9356 1241.2499 1244.2493 1252.5721 1263.5386 1277.9727 1320.5510 1338.9275 1349.1802 1361.5742 1419.5193 1422.8223 1432.1207 1433.5273 1445.0373 1452.1318 1455.7580 1461.9752 1463.8741 1465.7129 1466.0303 1466.5069 1471.9605 1473.9195 1478.6828 1568.1069 1574.9675 1594.3720 1600.7180 1620.6865 1700.0941 2849.1771 2862.8624 2955.0780 2969.1591 2994.9855 3003.2690 3012.5597 3030.5103 3040.8265 3059.9944 3061.3248 3064.3796 3081.6395 3087.5646 3127.1858 3129.5871 3132.0944 3151.3427 3164.2286 3173.0809 3481.6717
redmass: 5.1205 4.0459 4.7107 4.2221 4.0163 3.5003 4.0582 3.7581 4.2232 2.6757 3.1582 3.3143 1.3886 2.3325 1.2470 1.2886 3.5366 2.4837 3.8735 5.8156 4.9888 5.0138 3.1034 2.8718 4.0475 3.5129 3.5677 5.2475 5.4650 4.7018 3.4567 1.1458 6.1927 3.8300 4.2916 4.2701 5.0056 4.3136 4.2513 3.2543 4.9042 4.0963 4.7019 5.8049 4.7791 3.4862 1.3501 3.6456 2.9041 1.8738 3.5727 3.3028 1.9477 1.4420 2.2486 3.6674 4.7541 3.5507 2.2480 2.9731 5.1799 2.3288 1.3461 1.2679 1.7290 1.2551 1.6584 1.7757 1.7319 1.9853 1.9029 2.6733 1.4981 1.7748 2.8073 2.9571 1.5938 1.4252 1.8700 2.5863 2.3907 1.5170 1.4635 1.2279 2.0319 2.3396 3.3779 1.7930 1.1721 1.2352 1.4475 2.1678 1.0860 1.0841 1.9179 1.0531 1.0609 1.2046 1.0589 1.0535 1.0669 1.1953 10.4186 4.2431 1.2609 5.9252 6.6282 8.3831 1.0561 1.0780 1.0331 1.0323 1.0594 1.0598 1.0605 1.0725 1.1033 1.1046 1.1042 1.1054 1.1051 1.1019 1.0994 1.0989 1.0902 1.0933 1.0949 1.0895 1.0642
irintensity: 2.3843 3.3715 1.4509 4.9353 0.7144 0.2495 2.5676 2.6478 0.5540 2.1196 1.9528 1.4653 0.5732 1.3518 1.0372 0.1747 1.5425 0.4188 5.6495 5.1286 6.6931 1.9191 1.2545 3.0007 1.9863 7.4577 0.8812 1.8071 7.4420 7.6493 2.5828 103.4264 2.3924 8.1536 3.8756 5.1635 1.6041 0.7966 10.7440 1.3661 2.3421 2.1563 8.8164 2.7331 0.7458 9.3927 50.0522 16.7974 23.0036 25.9283 7.1645 14.6841 9.2564 3.0154 15.7115 45.5300 37.9143 14.2578 5.2461 46.5849 73.3569 14.8933 5.8035 0.3266 39.0452 0.1572 11.9002 11.3329 50.3316 15.3115 25.0499 99.2622 31.1105 14.9436 55.5175 24.7655 23.6787 1.1777 18.8751 39.4691 78.8913 115.9471 19.1317 3.9867 8.9698 12.2941 7.7174 57.7687 4.0316 10.7503 46.1927 45.3782 2.6423 10.3275 89.1847 11.0025 10.6814 6.2368 18.3663 28.6346 8.6351 2.8572 314.5630 15.7204 8.4703 85.9217 14.9454 57.7644 107.9279 55.6617 45.8220 70.6162 34.1168 15.0945 50.2864 47.7113 46.2682 37.7626 22.0597 7.0418 42.2245 23.3711 25.5915 26.5710 2.7647 2.2391 14.7182 12.7682 97.1618
temp: 298.150 k
press: 1.00000 atm
elementType: 8 8 8 8 7 6 6 6 6 6 6 6 6 6 6 6 6 6 6 6 6 6 6 6 1 1 1 1 1 1 1 1 1 1 1 1 1 1 1 1 1 1 1 1 1
symmnumber: 1
zpe: 947955.3 jmol-1
zpe.correction: 0.361057 hartree
zpe.thermalcorrener: 0.382901 hartree
zpe.thermalcorrenthalpy: 0.383845 hartree
zpe.thermalcorrgfe: 0.311875 hartree
zpe.sumelectzpe: -1090.350355 hartree
zpe.sumelectthermal: -1090.328511 hartree
zpe.sumelectthermalent: -1090.327567 hartree
zpe.sumelectthermalfe: -1090.399537 hartree
dipole: -8.3229 -3.0555 3.6689
dipole: 9.5951
quadrupole: -131.5260 -133.7457 -141.7669
quadrupole: -14.4242 16.2740 13.3242
quadrupole: 4.1536 1.9338 -6.0874 -14.4242 16.2740 13.3242
hfenergy: -1090.711412 hartree
pointgroup: C01 [X(C19H21N1O4)]
dipole: -3.2000808 -1.4964409 1.3307614 debye
polarizability: 267.5574573|4.3664482|238.44322|-7.9539231|10.8972576|183.6270707 unknown
InChI: InChI=1S/C19H21NO4/c1-20-7-6-19-10-16(24-3)14(21)9-12(19)13(20)8-11-4-5-15(23-2)18(22)17(11)19/h4-5,9-10,13,22H,6-8H2,1-3H3
charge 0 multiplicity 1
45 atoms
O  -2.049347 0.97568 1.528014
O  1.5176 3.818654 -0.129079
O  -4.330451 0.377939 0.383561
O  3.15591 2.532099 -1.862574
N  2.602789 -2.357321 0.42682
C  0.613202 0.167518 0.574206
C  1.381896 -1.87725 -0.276578
C  1.566811 -0.38037 -0.421779
C  1.222126 -0.55883 1.912585
C  -0.749631 -0.416563 -0.009007
C  0.498446 -2.233107 -1.489778
C  2.585811 -1.374477 1.632011
C  -0.773808 -1.393247 -1.098921
C  0.612143 1.672792 0.660524
C  2.407419 0.340823 -1.204345
C  -1.986379 0.097185 0.432584
C  2.482453 -3.776916 0.837484
C  1.442883 2.425771 -0.133258
C  -2.002067 -1.71959 -1.70625
C  2.400368 1.817912 -1.133831
C  -3.212451 -0.256967 -0.203721
C  -3.228015 -1.146355 -1.287023
C  0.61537 4.525301 0.781623
C  -5.645534 0.114124 -0.201932
H  0.604658 -2.039894 0.503649
H  0.447847 -1.19004 2.38428
H  1.490652 0.230938 2.637279
H  0.212497 -3.300561 -1.544742
H  0.921904 -1.928555 -2.462949
H  3.382942 -0.632619 1.454044
H  2.843152 -1.941365 2.546751
H  -0.087339 2.127805 1.365746
H  3.120978 -0.119747 -1.895225
H  1.535595 -4.0065 1.391102
H  3.337568 -4.051513 1.478728
H  2.516628 -4.415696 -0.0628
H  -2.011394 -2.459095 -2.514772
H  -4.161676 -1.42072 -1.786359
H  -3.007271 1.209214 1.667915
H  0.81541 5.593264 0.612779
H  0.825951 4.262582 1.837448
H  -0.443902 4.295258 0.552341
H  -5.901513 -0.959942 -0.127655
H  -5.677136 0.434927 -1.260548
H  -6.356297 0.708956 0.389954
