program: Gaussian 09
title: 000165127
version: EM64L-G09RevD.01
frameworkgroup: C1[X(C7H8S2)]
method: RPBEPBE
basis: SDD
operation: Freq
keyword: #p
keyword: freq=noraman
keyword: PBEPBE/SDD
title: #p freq=noraman PBEPBE/SDD
converged: YES YES NO NO
title: Mulliken charges:
elementType: S S C C C C C C C H H H H H H H H
charge: 0.036072 -0.147125 0.464204 -0.817976 -0.355415 -0.358678 -0.216588 -0.217017 -0.232347 0.273625 0.286432 0.240157 0.236523 0.230049 0.229582 0.231963 0.116536
chargesum: 0.00000
title: Mulliken charges with hydrogens summed into heavy atoms:
elementType: S S C C C C C C C
charge: 0.036072 -0.030589 0.464204 -0.257918 -0.115257 -0.122155 0.013462 0.012566 -0.000384
polarizability: 1.86852142e+02 2.21459511e+00 9.61034189e+01 1.22659136e+01 4.71106443e-01 6.08655491e+01
1716.lowfreq: -19.1024 -7.2599 -0.0025 -0.0016 0.0014 0.9806 31.3591 42.5789 69.5930
frequency: 31.1569 41.3480 69.5891 148.9865 231.8850 237.4972 325.7742 400.7464 411.6689 468.8435 544.8738 615.6740 644.1105 699.7444 754.6869 774.5625 802.3610 850.2853 897.6407 926.0076 976.8301 989.3183 998.1213 1025.1020 1067.4239 1115.4219 1173.9148 1187.5407 1216.7799 1226.4613 1324.1987 1386.3308 1439.9026 1454.8819 1480.9959 1591.1492 1610.6785 2390.9309 3045.9164 3124.2177 3125.0293 3127.7779 3139.2571 3151.0039 3167.1036
redmass: 6.0149 4.5584 6.8215 9.1613 4.4289 1.1514 2.2618 2.7953 26.4881 3.7792 5.8694 6.3422 4.6496 1.6823 1.0519 2.1483 3.9133 1.2495 1.4806 1.4358 1.3922 6.1069 1.3282 2.2033 1.4181 1.1276 1.0531 1.1111 1.8222 1.6140 1.2823 8.8810 2.1992 1.1143 2.3145 6.0316 6.1102 1.0392 1.0571 1.0902 1.1006 1.0923 1.0921 1.0965 1.1017
irintensity: 0.5076 2.1822 0.1116 1.8478 0.2478 27.1053 0.6462 0.0064 6.9951 8.9956 1.6020 0.1135 28.2996 59.8019 2.6266 29.1253 5.7101 0.0077 0.5450 1.9169 0.0047 0.5358 0.0343 6.9181 7.3301 3.2324 0.0177 1.4942 1.6022 10.9371 0.2034 0.4445 9.0151 7.4915 9.7924 0.9800 0.1700 30.7919 15.9983 2.7150 4.0682 3.3319 11.3044 37.8678 23.8618
temp: 298.150 k
press: 1.00000 atm
elementType: 16 16 6 6 6 6 6 6 6 1 1 1 1 1 1 1 1
symmnumber: 1
zpe: 331447.7 jmol-1
zpe.correction: 0.126242 hartree
zpe.thermalcorrener: 0.135832 hartree
zpe.thermalcorrenthalpy: 0.136776 hartree
zpe.thermalcorrgfe: 0.089098 hartree
zpe.sumelectzpe: -1066.994008 hartree
zpe.sumelectthermal: -1066.984418 hartree
zpe.sumelectthermalent: -1066.983474 hartree
zpe.sumelectthermalfe: -1067.031152 hartree
dipole: -1.8141 1.2166 1.2965
dipole: 2.5401
quadrupole: -64.9784 -61.9683 -72.6101
quadrupole: 5.2780 4.7797 0.2624
quadrupole: 1.5405 4.5507 -6.0912 5.2780 4.7797 0.2624
hfenergy: -1067.12025 hartree
pointgroup: C01 [X(C7H8S2)]
dipole: -0.7050061 -0.4681818 -0.5314616 debye
dipolederiv: 0.3222821 -0.0139102 -0.038824 -0.1136229 -0.1411247 0.0504196 -0.0431741 -0.0035951 -0.0058723 -0.3999451 0.0147969 -0.0670777 0.0942447 0.1873745 -0.0160158 0.0128506 0.0307007 -0.2350485 0.0163624 0.0021286 -0.0170413 0.0013018 -0.0055598 -0.0000753 -0.2622316 0.0020751 -0.1132108 0.2087855 -0.0018093 0.1285341 -0.0209713 0.1090907 -0.004884 0.2773288 0.0076821 0.2171726 -0.0109934 0.0917883 -0.0293088 -0.0512706 0.0426525 -0.0203174 -0.0528438 -0.0160618 -0.1351516 -0.0155419 -0.0856529 -0.03237 0.0588415 0.0425313 0.0259064 -0.0555311 0.0233149 -0.1377374 -0.0842383 -0.1047284 -0.0360342 -0.1465693 0.0799089 0.0190211 0.0037973 0.0345424 -0.1273731 -0.0722554 0.1090674 -0.0346177 0.1488119 0.0718477 -0.0136816 0.0052242 -0.0286036 -0.1284886 0.0665439 -0.000235 -0.077545 0.0027318 -0.0401238 0.0023818 -0.0661148 0.0015191 -0.1361003 -0.0219563 0.0150044 -0.0203462 0.0415171 -0.0312245 -0.1016502 -0.0468778 -0.0601538 -0.0293285 -0.0118274 -0.0134645 -0.0197863 -0.0330309 -0.0151013 0.0903749 -0.0447164 0.054243 -0.0157742 0.0462544 -0.0972216 0.0355924 -0.0776546 -0.0335441 0.0168004 0.0206003 0.0230227 0.1327582 0.0486259 0.0970059 0.038064 0.0769059 -0.0441039 -0.0227226 0.0237076 -0.0295703 0.1310319 0.025112 0.0824577 0.0298239 0.103362 -0.0702224 -0.0245087 0.0422075 -0.0251173 0.1496937 0.019039 -0.0857612 0.0287648 -0.1078315 -0.066629 0.0189242 0.0405157 0.0188471 0.1507983 -0.1189418 0.002401 0.069161 0.0023496 0.0889645 -0.0016291 0.0691313 -0.0015681 0.1411272 -0.0173055 -0.0118671 0.043011 0.0208847 -0.1747365 -0.0183438 0.0761264 -0.0312768 0.1415033 unknown
polarizability: 187.2434183|-2.1238443|96.0791318|-10.0632835|1.1021587|60.4985603 unknown
InChI: InChI=1S/C7H8S2/c8-9-6-7-4-2-1-3-5-7/h1-5,8H,6H2
charge 0 multiplicity 1
17 atoms
S  2.416848 -0.043468 0.856547
S  4.554378 0.090547 0.060373
C  -0.045857 -0.017151 -0.408094
C  1.413975 -0.034833 -0.788537
C  -0.722438 1.214204 -0.199373
C  -0.759538 -1.2317 -0.226726
C  -2.085743 1.231233 0.166696
C  -2.123148 -1.215916 0.139504
C  -2.790098 0.01593 0.336422
H  1.696765 -0.939742 -1.347585
H  1.724902 0.864244 -1.340869
H  -0.175643 2.156247 -0.324647
H  -0.242784 -2.187349 -0.375755
H  -2.597876 2.18756 0.319623
H  -2.664074 -2.15949 0.271219
H  -3.84826 0.028908 0.620364
H  4.771289 -1.278822 -0.056361
