program: Gaussian 09
title: 000165123
version: EM64L-G09RevD.01
frameworkgroup: C1[X(C2Br4F2)]
method: RPBEPBE
basis: SDD
operation: Freq
keyword: #pfreq=noraman
keyword: PBEPBE/SDD
title: #p freq=noraman PBEPBE/SDD
converged: NO YES NO NO
title: Mulliken charges:
elementType: Br Br Br Br F F C C
charge: 0.214290 0.214264 0.206864 0.140941 -0.113157 -0.113170 -0.751701 0.201669
chargesum: 0.00000
title: Mulliken charges with hydrogens summed into heavy atoms:
polarizability: 9.90748785e+01 -1.37791536e-01 8.55944757e+01 2.05698261e+01 4.49514307e-02 7.37765588e+01
1716.lowfreq: -8.4386 -0.0002 -0.0001 0.0003 0.2584 4.4718 57.4056 94.6949 115.0330
frequency: 57.3951 94.6945 115.0322 137.4532 166.0227 173.1287 207.7827 256.9910 260.7093 307.7164 355.9280 516.6977 600.6742 690.9289 720.7252 895.9301 1001.5192 1043.4208
redmass: 32.5102 72.1051 44.3537 60.8487 51.8927 47.0871 42.2455 20.6624 31.1948 24.6857 18.2860 16.7508 12.7920 12.6639 12.9924 12.9092 13.2365 12.5846
irintensity: 0.2387 0.1910 0.5376 0.1122 0.0051 0.3195 0.2068 1.2843 0.4824 0.0096 6.2479 13.0662 189.2722 169.8027 68.0089 137.7435 100.5218 114.0460
temp: 298.150 k
press: 1.00000 atm
elementType: 35 35 35 35 9 9 6 6
symmnumber: 1
zpe: 45474.5 jmol-1
zpe.correction: 0.017320 hartree
zpe.thermalcorrener: 0.027286 hartree
zpe.thermalcorrenthalpy: 0.028231 hartree
zpe.thermalcorrgfe: -0.021820 hartree
zpe.sumelectzpe: -329.072613 hartree
zpe.sumelectthermal: -329.062647 hartree
zpe.sumelectthermalent: -329.061702 hartree
zpe.sumelectthermalfe: -329.111753 hartree
dipole: 0.0758 0.0059 -1.3600
dipole: 1.3621
quadrupole: -78.2449 -81.0507 -83.2987
quadrupole: -0.0106 2.5454 0.0065
quadrupole: 2.6199 -0.1860 -2.4339 -0.0106 2.5454 0.0065
hfenergy: -329.0899329 hartree
pointgroup: C01 [X(C2Br4F2)]
dipole: -0.2659438 -0.4648184 -0.0202434 debye
dipolederiv: -0.0358 -0.0372978 0.0869924 -0.029209 -0.2429213 0.3495454 0.0557116 0.3158861 -0.5377248 -0.0388388 -0.0345398 -0.0990692 -0.0299047 -0.1885479 -0.3189074 -0.0676551 -0.2851393 -0.5893487 -0.2507914 0.3691808 0.0175607 0.293059 -0.5910656 -0.0261856 0.0136084 -0.0263706 -0.028556 -0.4091357 0.3186445 0.0195302 0.284978 -0.323816 -0.018537 0.0183022 -0.0190347 -0.0038135 -0.4470592 -0.0811932 0.130937 -0.017739 -0.5839965 0.3098364 0.027681 0.3088212 -0.5421732 -0.4494125 -0.0753073 -0.1407144 -0.0213915 -0.5244443 -0.3076279 -0.0314793 -0.3063586 -0.5992513 0.1951478 -0.4071679 -0.0077003 -0.1082348 1.1086221 -0.0122523 0.00702 -0.0088638 1.3679588 1.4358898 -0.0523193 -0.0075364 -0.3715581 1.3461695 0.0241284 -0.0231887 0.0210596 0.9329086 unknown
polarizability: 77.5605123|-22.4396956|95.2515022|-0.9814813|0.6523626|85.6338985 unknown
InChI: InChI=1S/C2Br4F2/c3-1(4,5)2(6,7)8
charge 0 multiplicity 1
8 atoms
Br -1.134173 -1.304102 1.600536
Br -1.16255 -1.163269 -1.685485
Br -1.867103 1.503107 0.078589
Br 2.071546 -1.255325 -0.082372
F  1.022621 1.118427 -1.089539
F  1.045591 1.007689 1.173303
C  -0.744222 -0.168762 -0.000397
C  0.768289 0.262135 0.005364
