program: Gaussian 09
title: 000165142
version: EM64L-G09RevD.01
frameworkgroup: C1[X(C12H16N4O6)]
method: RPBEPBE
basis: SDD
operation: Freq
keyword: #p
keyword: freq=noraman
keyword: PBEPBE/SDD
title: #p freq=noraman PBEPBE/SDD
converged: YES YES NO NO
title: Mulliken charges:
elementType: O O O O O O N N N N C C C C C C C C C C C C H H H H H H H H H H H H H H H H
charge: -0.307179 -0.456065 -0.453448 -0.425300 -0.230143 -0.268763 -0.207048 -0.182480 -0.019986 -0.228027 -0.037587 -0.122158 -0.251498 -0.030047 -0.340412 0.294993 -0.232955 -0.105951 0.178944 0.240484 -0.668656 -0.598688 0.291300 0.254894 0.249452 0.261846 0.186402 0.233192 0.281590 0.379435 0.375131 0.285676 0.292372 0.234372 0.356856 0.249389 0.247796 0.272265
chargesum: 0.00000
title: Mulliken charges with hydrogens summed into heavy atoms:
elementType: O O O O O O N N N N C C C C C C C C C C C C
charge: -0.307179 -0.076631 -0.078317 -0.068443 -0.230143 -0.268763 -0.207048 -0.182480 -0.019986 -0.228027 0.253713 0.132736 -0.002046 0.231799 0.079182 0.294993 0.048634 -0.105951 0.178944 0.240484 0.143765 0.170763
polarizability: 2.41896967e+02 -3.44834333e+00 1.75643423e+02 -1.44059313e+00 -1.48161108e+01 1.17060039e+02
1716.lowfreq: -4.9561 -2.6320 -0.0010 -0.0009 -0.0006 8.6691 13.2606 32.7209 36.3040
frequency: 12.7351 32.6255 36.2333 60.0770 80.7578 90.7012 108.2755 121.4236 137.7859 154.2437 165.6565 179.3746 215.6734 242.7090 268.2429 279.2034 289.2553 293.6374 298.1327 319.6912 326.0758 348.2586 369.1290 375.2607 393.5118 410.1646 425.0086 444.4291 494.3837 516.3139 534.0880 546.1000 556.3576 625.5975 640.6295 645.3480 686.1686 698.4542 707.7954 750.6284 764.3542 787.8505 804.6057 830.3730 874.5163 902.4374 947.4302 959.7163 978.0959 992.8548 1013.7682 1018.1994 1021.8217 1035.1734 1036.9132 1062.2866 1093.3129 1113.6803 1126.0405 1131.1006 1162.8166 1175.0203 1188.3867 1199.8825 1202.6609 1221.8981 1236.6752 1264.5986 1268.4673 1277.9731 1288.5415 1302.6880 1310.4822 1317.5976 1338.6541 1342.4786 1354.9799 1374.6421 1384.5310 1397.5697 1417.3720 1429.3135 1433.3105 1457.8128 1469.1238 1476.6236 1478.1066 1498.6735 1511.6283 1565.9281 1608.5831 1663.5933 2951.0357 2989.7895 3003.9778 3011.7926 3012.3396 3029.1017 3075.4423 3082.0752 3085.2325 3104.5552 3119.4000 3139.1585 3268.1455 3424.7087 3558.9790 3600.5149
redmass: 5.9409 6.0954 5.9964 6.5527 4.9080 4.6665 2.4237 1.4176 5.1161 3.3789 4.9308 5.4741 2.4753 3.8326 1.7610 1.6107 4.5021 5.0420 3.1130 3.4455 2.6717 4.7970 4.6973 3.9965 3.3421 5.4382 1.4657 8.9614 7.4198 3.7931 4.8218 3.6301 1.3241 4.2233 4.9795 11.2893 5.9963 5.6434 10.8942 6.6035 4.8559 1.5280 5.1466 3.0856 3.2610 4.4883 4.4953 4.2314 4.6863 3.8495 3.7489 3.6165 3.3741 3.2894 2.8538 5.1807 3.2041 2.0009 1.3012 1.3076 1.4810 1.7657 1.4593 1.3254 1.4672 3.2502 2.6784 1.2520 1.2959 6.4129 1.2913 4.1330 1.3290 1.3031 1.3496 1.2683 5.1425 1.3879 1.3494 1.5558 1.4047 1.6195 2.2823 1.0836 1.7343 1.0497 1.1560 1.7122 1.0532 6.8771 9.6843 10.9097 1.0689 1.0360 1.0863 1.0851 1.0329 1.0873 1.0860 1.0945 1.1025 1.1023 1.0984 1.1022 1.0981 1.0644 1.0661 1.0672
irintensity: 3.6054 2.4971 4.0089 1.3778 2.0927 3.8788 9.3421 2.5782 2.4202 0.2200 0.1630 2.3269 25.9898 13.9553 14.2721 14.1078 11.7875 2.6649 2.0553 5.6792 2.8408 7.3238 22.9702 6.3232 30.4936 32.8926 134.2846 2.1558 12.7020 9.7121 1.0944 49.8440 115.0639 1.9765 22.1474 2.8023 31.9797 34.6938 11.7863 21.4301 2.1648 13.1860 24.5195 23.4971 20.5765 9.9219 130.2080 25.0382 79.3699 153.6446 17.9548 34.1171 105.8502 39.2551 9.8529 80.1111 9.1043 14.0418 1.1097 0.1178 29.0256 9.5449 36.4034 58.8207 44.9009 14.5318 5.7098 1.3472 19.3655 163.3392 21.3775 8.2004 4.4687 6.4645 46.2769 27.3431 49.1235 25.6322 15.7039 16.7761 22.5993 33.1835 30.4719 5.7312 84.2173 17.7421 6.7110 184.6119 24.4975 50.5117 530.4727 391.3100 49.4839 36.2816 27.3657 2.8272 29.4176 49.8014 9.3055 18.5095 10.6270 17.7339 2.6951 1.0204 1.7127 72.7627 13.0206 33.5371
temp: 298.150 k
press: 1.00000 atm
elementType: 8 8 8 8 8 8 7 7 7 7 6 6 6 6 6 6 6 6 6 6 6 6 1 1 1 1 1 1 1 1 1 1 1 1 1 1 1 1
symmnumber: 1
zpe: 762329.4 jmol-1
zpe.correction: 0.290356 hartree
zpe.thermalcorrener: 0.311398 hartree
zpe.thermalcorrenthalpy: 0.312342 hartree
zpe.thermalcorrgfe: 0.239114 hartree
zpe.sumelectzpe: -1135.547025 hartree
zpe.sumelectthermal: -1135.525983 hartree
zpe.sumelectthermalent: -1135.525039 hartree
zpe.sumelectthermalfe: -1135.598267 hartree
dipole: 6.3122 4.0122 2.5537
dipole: 7.9034
quadrupole: -144.0626 -150.9527 -119.1379
quadrupole: -3.0614 20.9513 6.4252
quadrupole: -6.0115 -12.9016 18.9132 -3.0614 20.9513 6.4252
hfenergy: -1135.8373808 hartree
pointgroup: C01 [X(C12H16N4O6)]
dipole: 2.5152269 -1.4645121 -1.0942291 debye
polarizability: 241.7410105|4.3926087|177.5835887|2.9301957|-10.3886503|115.2758293 unknown
InChI: InChI=1S/C12H16N4O6/c1-14-9-6(10(20)15(2)12(14)21)13-4-16(9)11-8(19)7(18)5(3-17)22-11/h4-5,7-8,11,17-19H,3H2,1-2H3
charge 0 multiplicity 1
38 atoms
O  2.477775 0.482683 0.974987
O  2.105938 -2.459875 -0.584163
O  4.247535 -1.319453 -1.654054
O  5.080425 1.5566 1.764549
O  -3.995665 2.285489 -0.630975
O  -3.800388 -2.274238 0.485818
N  0.209094 0.471361 0.298438
N  -1.765967 -1.104298 0.459519
N  -0.939379 2.362585 -0.293765
N  -3.859383 -0.004696 -0.072902
C  1.394903 -0.381709 0.480212
C  1.911081 -1.039957 -0.839687
C  3.29211 -0.352564 -1.101817
C  3.745843 0.069212 0.308511
C  4.698147 1.25981 0.386623
C  -1.145041 0.117669 0.241218
C  0.266744 1.849388 -0.04471
C  -1.833189 1.292941 -0.126411
C  -3.274324 1.306297 -0.306265
C  -3.18692 -1.184807 0.297639
C  -1.075497 -2.332409 0.913006
C  -5.327767 -0.135671 -0.22908
H  1.183056 -1.175534 1.21292
H  1.198557 -0.892292 -1.673183
H  3.1705 0.530315 -1.758854
H  4.175481 -0.803006 0.839972
H  4.229523 2.14086 -0.104924
H  5.639669 1.012918 -0.132168
H  1.205171 2.393054 -0.028767
H  2.971886 -2.71565 -1.013009
H  4.360178 -1.187005 -2.627196
H  -0.267138 -2.625665 0.222118
H  -1.835734 -3.127678 0.934453
H  -0.67475 -2.20398 1.934623
H  4.255552 1.730569 2.286628
H  -5.781832 -0.466185 0.719296
H  -5.561385 -0.882966 -1.004831
H  -5.711705 0.853684 -0.516971
